{"text_format":"1","workbook":"xlsx","n_sheets":16,"sheets":["Nota","Modes.d'emploi","Comment copier-coller","Code VBA","qu'est-ce qu'un \"Postit\"","Modèle.Portrait.1","Modèle.Portrait.2.une.fiche","Modèle.Portrait.2.deux.FICHES","Vocabulaire","Cuisiniers.Pesez","Poids fruits et légumes","Tutos Youtube","Formats-Formules-Fonctions","Emoticones ","Polices de Symboles","CODES COULEURS"],"not_rendered":{"charts":0,"images":40,"macros":1,"external_links":0,"defined_names":4,"comments":0,"pivot_tables":0},"unopened":[],"bounds":{"document_bytes":16777216,"sheet_cells":100000,"rows_first":2000,"rows_last":500,"rows_between":2000,"halvings":0,"cell_chars":16384,"cell_head_chars":4096},"cells_cut":0,"cells_raw":0,"read":"whole","date_system":"1900"}

{"sheet":"Nota","index":0,"n_rows":114,"n_cols":32,"rows_kept":114,"cut":false,"hidden":false,"merged":[[9,1,9,19],[8,24,8,30],[112,1,112,21],[1,18,2,21],[6,1,6,2],[111,2,111,10]]}
[]
[null,"Ces documents sont les fruits :",null,null,null,null,null,null,null,null,null,null,null,null,null,null,null,null,"VERSION E"]
[null,"de mon expérience et des utilitaires de la restauration collective"]
[null,"de formules et fonctions Excel mises sur le net par des passionnés ",null,null,null,null,null,null,null,null,null,null,null,null,null,null,null,null,"dernière mise à jour : 19Décembre 2021"]
[null,"A vous de les faire évoluer  et de les modifier pour votre utilisation.......",null,null,null,null,null,null,null,null,null,null,null,null,null,null,null,null,{"$f":"\"Page \"&_xlfn.SHEET()&\" sur \"&_xlfn.SHEETS()","v":"Page 1 sur 16"}]
[]
[null,"Adresse PC",null,{"$f":"CELL(\"nomfichier\")","v":"E:\\0-UPRT\\1-UPRT.FR-SITE-WEB\\re-recettes-jean-marc-catteau\\re-catteau-galettes\\[GA-pate.sud.finistere.xlsm]Modes.d'emploi"}]
[]
[null,null,null,null,null,null,null,null,null,null,null,null,null,null,null,null,null,null,null,null,null,null,null,null,"Mémo : couleurs diététique des aliments"]
[null,"CONTENU DU CLASSEUR",null,null,null,null,null,null,null,null,null,null,null,null,null,null,null,null,null,null,null,null,null,null,"Couleur diététique",null,"Couleur diététique",null,"Couleur diététique",null,"Couleur diététique"]
[null,null,"Vous êtes dans un classeur xlsm  certaines feuilles contiennent du code VBA  dans Worksheet",null,null,null,null,null,null,null,null,null,null,null,null,null,null,null,null,null,null,null,null,null,"Protéines",null,"Cuidités",null,"Crudités",null,"Féculent"]
[null,null,null,null,null,null,null,null,null,null,null,null,null,null,null,null,null,null,null,null,null,null,null,null,"Hex : #FF0000",null,"Hex : #99CC00",null,"Hex : #008000",null,"Hex : #800000"]
[null,null,"COMMENT COPIER/ COLLER DANS UNE FEUILLE ",null,null,null,null,null,null,null,null,null,null,null,null,null,null,null,null,null,null,null,null,null,"Abats",null,"Agrumes  Pomme Pample.)",null,"Agrumes  Pomme Pample.)",null,"Blé"]
[null,null,null,null,null,null,null,null,null,null,null,null,null,null,null,null,null,null,null,null,null,null,null,null,"Abattis",null,"Artichaut",null,"Avocat",null,"Boulghour"]
[null,null,"CODE VBA POUR METTRE EN SURBRILLANCE LA LIGNE ET LA COLONNE ACTIVES DANS EXCEL",null,null,null,null,null,null,null,null,null,null,null,null,null,null,null,null,null,null,null,null,null,"Agneau",null,"Asperges",null,"Betteraves",null,"Féves"]
[null,null,null,null,null,null,null,null,null,null,null,null,null,null,null,null,null,null,null,null,null,null,null,null,"Bœuf",null,"Betteraves",null,"Carottes",null,"Févettes"]
[null,null,"QU'EST-CE QU'UNE FICHE DE FABRICATION  DE TYPE \"POSTIT\"©",null,null,null,null,null,null,null,null,null,null,null,null,null,null,null,null,null,null,null,null,null,"Cailles",null,"Carottes",null,"Céléri branche",null,"H. Cocos"]
[null,null,null,"SERVICE AU POIDS Explication",null,null,null,null,null,null,null,null,null,null,null,null,null,null,null,null,null,null,null,null,"Canard",null,"Céléri branche",null,"Céléri rave",null,"H. Flageolets"]
[null,null,null,null,null,null,null,null,null,null,null,null,null,null,null,null,null,null,null,null,null,null,null,null,"Charcuteries",null,"Céléri rave",null,"Champignons",null,"H. Noirs"]
[null,null,"MODÈLE PORTRAIT 1",null,null,null,null,null,null,null,null,null,null,null,null,null,null,null,null,null,null,null,null,null,"Coquillages",null,"Champignons",null,"Chou blanc",null,"H. Rouges"]
[null,null,null,"Recette au poids et au NOMBRE DE GALETTES",null,null,null,null,null,null,null,null,null,null,null,null,null,null,null,null,null,null,null,null,"Crustacés",null,"Chou blanc",null,"Chou rouge",null,"H. Soisson"]
[null,null,null,"1 seule fiche imprimable sur feuille A4",null,null,null,null,null,null,null,null,null,null,null,null,null,null,null,null,null,null,null,null,"Dinde",null,"Chou rouge",null,"Choux Brocolis",null,"H.Blancs"]
[null,null,null,null,"❼ A dupliquer pour",null,null,null,null,null,null,null,null,null,null,null,null,null,null,null,null,null,null,null,"Farces",null,"Choux Brocolis",null,"Choux Chinois",null,"Lentilles"]
[null,null,null,null,2.5,10,null,null,null,null,null,null,null,null,null,null,null,null,null,null,null,null,null,null,"Gibier à plumes",null,"Choux Bruxelles",null,"Choux fleur",null,"Maïs"]
[null,null,null,"pour 1 Kg","Kg","Galettes",null,null,null,null,null,null,null,null,null,null,null,null,null,null,null,null,null,null,"Gibier à poil",null,"Choux Chinois",null,"Choux Romanesco",null,"P.Terre"]
[null,null,null,"Postit de 16 lignes de produits",null,null,null,null,null,null,null,null,null,null,null,null,null,null,null,null,null,null,null,null,"Jus / Bouillon",null,"Choux de Milan",null,"Concombres",null,"Pâtes"]
[null,null,null,null,null,null,null,null,null,null,null,null,null,null,null,null,null,null,null,null,null,null,null,null,"Lapin",null,"Choux fleur",null,"Courgettes",null,"Pois chiches"]
[null,null,"MODÈLE PORTRAIT 2 une fiche",null,null,null,null,null,null,null,null,null,null,null,null,null,null,null,null,null,null,null,null,null,"Mouton",null,"Choux Romanesco",null,"Endives",null,"Polenta"]
[null,null,null,"1 seule fiche imprimable sur feuille A4",null,null,null,null,null,null,null,null,null,null,null,null,null,null,null,null,null,null,null,null,"Œufs",null,"Cœur de Palmier",null,"Epinards",null,"Riz"]
[null,null,null,"Recette au nombre de PORTIONS",null,null,null,null,null,null,null,null,null,null,null,null,null,null,null,null,null,null,null,null,"Poisson",null,"Concombres",null,"Fenouil",null,"Rutabaga"]
[null,null,null,"2 blocs de 15 lignes sur une fiche imprimable sur feuille A4",null,null,null,null,null,null,null,null,null,null,null,null,null,null,null,null,null,null,null,null,"Porc",null,"Courge",null,"Navets",null,"Semoule"]
[null,null,null,null,null,null,null,null,null,null,null,null,null,null,null,null,null,null,null,null,null,null,null,null,"Poule",null,"Courgettes",null,"Oignons",null,"Topinambour"]
[null,null,null,"❹ Unités","❺  Poids","❸ Ingrédients","⑦ Quantités","%","❻ Quoi","❹ Unités","❺  Poids","❸ Ingrédients","⑦ Quantités","%","❻ Quoi",null,null,null,null,null,null,null,null,null,"Poulet",null,"Crosne",null,"Poivrons jaunes"]
[null,null,null,null,null,"S.Total saisi >",0.27500000000000002,null,null,null,null,"S.Total saisi >",0,null,null,null,null,null,null,null,null,null,null,null,"Veau",null,"Endives",null,"Poivrons rouges"]
[null,null,null,8,0.05,"œufs",0.2,0.72727272727272729,"Kg",null,null,"Chair à saucisse",0,"","Kg",null,null,null,null,null,null,null,null,null,null,null,"Epinards",null,"Poivrons verts"]
[null,null,null,null,null,null,null,null,null,null,null,null,null,null,null,null,null,null,null,null,null,null,null,null,"Mode de cuisson",null,"Fenouil",null,"Radis noirs"]
[null,null,"MODÈLE PORTRAIT 2 deux FICHES",null,null,null,null,null,null,null,null,null,null,null,null,null,null,null,null,null,null,null,null,null,"Braisé",null,"Navets",null,"Radis roses"]
[null,null,null,"2 fiches imprimables sur feuille A4",null,null,null,null,null,null,null,null,null,null,null,null,null,null,null,null,null,null,null,null,"Confit",null,"Oignons",null,"Sal.Batavia"]
[null,null,null,"Recette au nombre de PORTIONS comme le modèle précédent",null,null,null,null,null,null,null,null,null,null,null,null,null,null,null,null,null,null,null,null,"Frit",null,"Patisson",null,"Sal.Chicorée"]
[null,null,null,"2 blocs de 15 lignes par fiche",null,null,null,null,null,null,null,null,null,null,null,null,null,null,null,null,null,null,null,null,"Fumé",null,"Poivrons jaunes",null,"Sal.Cresson"]
[null,null,null,null,null,null,null,null,null,null,null,null,null,null,null,null,null,null,null,null,null,null,null,null,"Grillé",null,"Poivrons rouges",null,"Sal.Endive"]
[null,null,"VOCABULAIRE PROFESSIONNEL",null,null,null,null,null,null,null,null,null,null,null,null,null,null,null,null,null,null,null,null,null,"Nature",null,"Poivrons verts",null,"Sal.Feuille de chêne"]
[null,null,null,"Vocabulaire \" cuisine de composition\"",null,null,null,null,null,null,null,null,null,null,null,null,null,null,null,null,null,null,null,null,"Papillotes",null,"Potiron",null,"Sal.Frisée"]
[null,null,null,"Vocabulaire\"La CUISINE DE REFERENCE\" Michel MAINCENT",null,null,null,null,null,null,null,null,null,null,null,null,null,null,null,null,null,null,null,null,"Poché",null,"Pousses de bambou",null,"Sal.Iceberg"]
[null,null,null,"Vocabulaire    un verbe…une action",null,null,null,null,null,null,null,null,null,null,null,null,null,null,null,null,null,null,null,null,"Poellé",null,"Radis noirs",null,"Sal.Krisette"]
[null,null,null,"Quelques verbes d'action complémentaires",null,null,null,null,null,null,null,null,null,null,null,null,null,null,null,null,null,null,null,null,"Râgouts",null,"Radis roses",null,"Sal.Laitue"]
[null,null,null,"Le vocabulaire professionnel en pâtisserie",null,null,null,null,null,null,null,null,null,null,null,null,null,null,null,null,null,null,null,null,"Rôti",null,"Salade",null,"Sal.Lola rosa"]
[null,null,null,null,null,null,null,null,null,null,null,null,null,null,null,null,null,null,null,null,null,null,null,null,"Saumuré",null,"Salsifis",null,"Sal.Mâche"]
[null,null,"CUISINIERS : PESEZ …..EVITEZ LES VOLUMES , N'UTILISEZ QUE LES POIDS COMME LES PATISSIERS",null,null,null,null,null,null,null,null,null,null,null,null,null,null,null,null,null,null,null,null,null,"Sauté avec Sauce",null,"Soja",null,"Sal.Mesclun"]
[null,null,null,null,null,null,null,null,null,null,null,null,null,null,null,null,null,null,null,null,null,null,null,null,"Sauté sans Sauce",null,"Tomates cerises",null,"Sal.Pissenlit"]
[null,null,"POIDS DES FRUITS ET LÉGUMES",null,null,null,null,null,null,null,null,null,null,null,null,null,null,null,null,null,null,null,null,null,"Vapeur",null,"Tomates Marmande",null,"Sal.Romaine"]
[null,null,null,"Saisissez votre nombre d'unité (encre rouge)Modifiez le poids unitaire (encre verte) s'il n'est pas excact",null,null,null,null,null,null,null,null,null,null,null,null,null,null,null,null,null,null,null,null,null,null,"Tomates olivette",null,"Sal.Scarole"]
[null,null,null,null,null,null,null,null,null,null,null,null,null,null,null,null,null,null,null,null,null,null,null,null,null,null,"Tomates Romaine",null,"Sal.Trévise"]
[null,null,"TUTOS EXCEL YOUTUBE",null,null,null,null,null,null,null,null,null,null,null,null,null,null,null,null,null,null,null,null,null,null,null,null,null,"Salade"]
[null,null,null,"Il arrive que vous ayez 2 tutos pour la même fonction, ",null,null,null,null,null,null,null,null,null,null,null,null,null,null,null,null,null,null,null,null,null,null,null,null,"Salades composées"]
[null,null,null,"c'est volontaire parce que le plus important c'est de cliquer sur le nom de l'auteur sous la vidéo pour découvrir sa liste",null,null,null,null,null,null,null,null,null,null,null,null,null,null,null,null,null,null,null,null,null,null,null,null,"Salsifis"]
[null,null,null,null,null,null,null,null,null,null,null,null,null,null,null,null,null,null,null,null,null,null,null,null,null,null,null,null,"Soja"]
[null,null,"FORMAT - FORMULES ET FONCTIONS",null,null,null,null,null,null,null,null,null,null,null,null,null,null,null,null,null,null,null,null,null,null,null,null,null,"Tomates"]
[null,null,null,"pour vous aider dans la conception de vos documents",null,null,null,null,null,null,null,null,null,null,null,null,null,null,null,null,null,null,null,null,null,null,null,null,"Tomates cerises"]
[null,null,null,null,null,null,null,null,null,null,null,null,null,null,null,null,null,null,null,null,null,null,null,null,null,null,null,null,"Tomates Marmande"]
[null,null,"EMOTICONES",null,null,null,null,null,null,null,null,null,null,null,null,null,null,null,null,null,null,null,null,null,null,null,null,null,"Tomates olivette"]
[null,null,null,"Copiez/Collez des émoticônes dans vos documents",null,null,null,null,null,null,null,null,null,null,null,null,null,null,null,null,null,null,null,null,null,null,null,null,"Tomates Romaine"]
[]
[null,null,"POLICE DE SYMBOLES"]
[null,null,null,"Comment choisir sa police de symboles"]
[]
[null,null,"Palette de couleurs Excel"]
[null,null,null,"Lien >","Codes de couleur HTML sécurisés pour le Web / Tableau de référence"]
[null,null,null,"Lien >","Correspondance des couleurs de peinture et convertisseur"]
[]
[]
[null,"Quelques polices de caractères utilisées",null,null,null,null,null,null,null,null,null,null,null,null,null,null,"Quelques formats utilisés"]
[null,null,"Arial",null,"Calibri",null,"Rockwell",null,null,"Verdana",null,null,null,null,null,null,"15.5 >",null,15.5,null,15.5,null,15.5]
[null,null,"ARIAL",null,"CALIBRI",null,"ROCKWELL",null,null,"VERDANA",null,null,null,null,null,null,"personnalisés >",null,"0.000\" Kg\"",null,"0\" %\"",null,"Monétaire"]
[]
[null,"Autres polices à découvrir"]
[null,null,"ARIAL NARROW    Arial Narrow",null,null,null,null,"COMIC SANS MF  Comic Sans MF",null,null,null,null,null,null,null,"GIL SANS MT  Gill Sans MT",null,null,null,null,null,"PALATINO LINOTYPE  Palatino Linotype"]
[null,null,"TAHOMA   Tahoma",null,null,null,null,"TIMES NEW ROMAN Times New Roman",null,null,null,null,null,null,null,"TRBUCHET MF  Trébuchet MF",null,null,null,null,null,"TW CEN MT  Tw Cen MT"]
[null,null,"VRINDA   Vrinda"]
[null,"Une numérotation avec couleur de police modifiable"]
[null,null,"❶","❷","❸","❹","❺","❻","❼","❽","❾","❿","⓫","⓬","⓭","⓮","⓯","⓰","⓱","⓲","⓳","⓴"]
[]
[null,null,"❶","❷","❸","❹","❺","❻","❼","❽","❾","❿","⓫","⓬","⓭","⓮","⓯","⓰","⓱","⓲","⓳","⓴"]
[]
[null,null,1,"2","3","4","5","6","7","8","9","10","11","12","13","14","15","16","17","18","19","20"]
[]
[null,null,1,2,3,4,5,6,7,8,9,10,11,12,13,14,15,16,17,18,19,20]
[]
[null,null,"⓪①②③④⑤⑥⑦⑧⑨⑩⑪⑫⑬⑭⑮⑯⑰⑱⑲⑳",null,null,null,null,null,null,null,null,"couleur de police blanc sur fond gris à modifier pour vos documents"]
[null,null,"cliquez sur la colonne  C et sélectionnez dans la barre le numéro qui vous intéresse"]
[null,null,"⓿❶❷❸❹❺❻❼❽❾❿⓫⓬⓭⓮⓯⓰⓱⓲⓳⓴"]
[]
[null,"des caractères spéciaux"]
[null,"!","\"","#",null,"%","&","@","‰","≈","±","»","¼","½","¾","ø","►","◄","▲","▼","Φ"]
[]
[null,null,"0.00\\ \" cm³\"",null,null,"Format | cellule | personnalisé | 0\" cm³\""]
[null,null,3]
[null,null,null,null,null,null,null,"ou copier-coller",null,null,null,null,null,"X","t","u"]
[null,null,"le ² se fait en tapant alt+0178",null,null,null,null,"m² ","M² ","cm² ","²",null,null,"Police Wingdings 3"]
[null,null,"le ³ se fait en tapant alt+0179",null,null,null,null,"m³ ","M³ ","cm³ ","³",null,null,"Z","q","p"]
[]
[]
[null,null,"lien >","Les unités pifométriques"]
[null,null,"Je remercie chaleureusement les internautes passionnés qui élaborent et proposent des formules et fonctions imbriquées"]
[]
[null,"Transmettez votre savoir et votre savoir faire  peu importe qui le récupère; pourvu qu'un plus grand nombre puisse en bénéficier."]
[null,"Joël LEBOUCHER …Octobre 2015"]
[null,"un lien rompu ou devenu obsolète…..pas de panique…Google saura vous retrouver un document équivalent"]
[]
[null,"Site à découvrir"]
[null,"SPACE pour Suivi et Programmation d'ACtivités en Equipe est un outil destiné à permettre un suivi exhaustif des activités d'une équipe."]
["lien >",null,"Fil de discussion dédié à ce programme "]
[" >","http://www.excel-downloads.com/remository/Download/Professionnels/Planification-et-gestion-de-projets/SPACE.html",null,null,null,null,null,null,null,null,null,null,null,null,null,null,null,null,null,null,null,null,null,null,null,null,null,null,null,null,null,"FIN"]
[null,null,null,null,null,null,null,null,null,null,null,null,null,null,null,null,null,null,null,null,null,null,null,null,null,null,null,null,null,null,null,{"$f":"ADDRESS(ROW(),COLUMN(),4)","v":"AF114"}]

{"sheet":"Modes.d'emploi","index":1,"n_rows":58,"n_cols":29,"rows_kept":58,"cut":false,"hidden":false,"merged":[[39,2,40,5],[39,16,40,20],[42,2,43,5],[27,2,29,5],[30,2,32,5],[30,16,31,20],[33,23,38,26],[35,2,36,5],[37,2,38,5],[37,16,38,20],[8,24,11,27],[9,2,10,5],[9,16,10,20],[12,2,12,5],[13,2,13,5],[13,9,16,12],[13,16,13,20],[13,24,16,27],[14,16,14,20],[6,2,7,5],[6,7,28,7],[6,16,7,20],[6,22,28,22],[8,2,8,5],[8,9,11,12],[8,16,8,20],[17,2,17,5],[19,2,20,5],[19,16,20,20],[1,1,2,13],[1,15,2,27],[4,2,5,5],[4,7,5,7],[4,16,5,20],[4,22,5,22]]}
[]
[null,"Mode d'emploi du modèle 1 ",null,null,null,null,null,null,null,null,null,null,null,null,null,"Mode d'emploi du modèle 2"]
[]
[null,null,null,null,null,null,null,null,null,null,null,null,null,null,null,null,12,12,19,12,12]
[null,null,"Récap du Mode d'emploi  de la fiche recette",null,null,null,null,"ICI",null,null,null,null,null,null,null,null,"Récap du Mode d'emploi  de la fiche recette",null,null,null,null,null,"ICI"]
[]
[null,null,"Recette au poids et au NOMBRE DE GALETTES",null,null,null,null,"Sur la tranche des fiches indiquez : CETTE RECETTE EST A CLASSER DANS QUELLE FAMILLE",{"$f":"H7","v":"Sur la tranche des fiches indiquez : CETTE RECETTE EST A CLASSER DANS QUELLE FAMILLE"},null,null,null,null,null,null,null,"Recette au nombre de PORTIONS",null,null,null,null,null,"Sur la tranche des fiches indiquez : DANS QUELLE FAMILLE CETTE RECETTE EST A CLASSER ",{"$f":"W7","v":"Sur la tranche des fiches indiquez : DANS QUELLE FAMILLE CETTE RECETTE EST A CLASSER "}]
[]
[null,null,"à saisir",null,null,null,null,null,null,"J'ai volontairement augmenté le nombre de portions ❺ pour diminuer le poids pour 1 galette en g ⑥ à vous d'ajuster selon votre clientèle",null,null,null,null,null,null,"à saisir",null,null,null,null,null,null,null,"J'ai parfois volontairement augmenté le nombre de portions ❽ pour diminuer  le poids pour 1 portion ⑩ qui ne convenait pas à mes convives"]
[null,null,"❶ NOM de la recette a saisir et N° ou lettre Alpha",null,null,null,null,null,null,null,null,null,null,null,null,null,"① NOM de la recette a saisir et N° ou lettre Alpha"]
[]
[null,null,"❷ Unités.Poids.Compositon",null,null,null,null,null,null,null,null,null,null,null,null,null,"② saisissez le nom de Auteur"]
[null,null,"Poids à saisir en Kg"]
[null,null,"Exep. 3 œufs de 0.050",null,null,null,null,null,null,"le surlignage des lignes et colonnes s'obtient avec une Mise en forme conditionnelle MFC avec cette formule =OU(LIGNE()=CELLULE(\"ligne\");COLONNE()=CELLULE(\"colonne\")) ",null,null,null,null,null,null,"Poids à saisir en Kg",null,null,null,null,null,null,null,"le surlignage des lignes et colonnes s'obtient avec une Mise en forme conditionnelle MFC avec cette formule =OU(LIGNE()=CELLULE(\"ligne\");COLONNE()=CELLULE(\"colonne\")) "]
[null,null,null,"❷ Unités","❷  Poids","❸ Quoi",null,null,null,null,null,null,null,null,null,null,"Exep. 3 œufs de 0.050"]
[null,null,null,3,0.05,"kg",null,null,null,null,null,null,null,null,null,null,"❹ Unités","❺  Poids","❸ les Ingrédients","⑦ Quantités","❻ Quoi"]
[null,null,"ou",3,null,"Œufs",null,null,null,null,null,null,null,null,null,null,3,0.05,"œufs",2.5,"Kg"]
[null,null,"ou œufs liquides",null,null,null,null,null,null,"et cette commande de code dans Worksheet",null,null,null,null,null,null,null,0.15,"ou œufs liquides",0.72499999999999998,"Kg",null,null,null,"et cette commande de code dans Worksheet"]
[null,null,null,null,0.15,"kg",null,null,null," Private Sub Worksheet_SelectionChange(ByVal Target As Range)  ",null,null,null,null,null,null,3,null,"œufs",12,"œufs",null,null,null," Private Sub Worksheet_SelectionChange(ByVal Target As Range)  "]
[null,null,"❸ Lorsque vous avez des produits à l'unité réduisez les décimales pour une meilleure lecture",null,null,null,null,null,null,"  Calculate",null,null,null,null,null,null,"⑦ Lorsque vous avez des produits à l'unité réduisez les décimales pour une meilleure lecture",null,null,null,null,null,null,null,"  Calculate"]
[null,null,null,null,null,null,null,null,null,"End Sub",null,null,null,null,null,null,null,null,null,null,null,null,null,null,"End Sub"]
[null,null,"utilisez le pinceau pour ce faire",null,null,null,null,null,null,15,15,15,15,"largeur de colonnes",null,null,null,null,null,"⑦ Quantités","❻ Quoi",null,null,null,15,15,15,15]
[null,null,"pour 1 Kg","Kg","Galettes",null,null,null,null,null,null,null,null,null,null,null,null,null,"utilisez le pinceau pour ce faire",12,"œufs"]
[null,null,1,1,1.2,null,null,null,null," total saisi >","SI(ESTVIDE(Q5);R5;Q5*R5)+SI(ESTVIDE(Q6);R6;Q6*R6) etc…",null,null,null,null,null,null,null,null,null,null,null,null,null,"Cours VBA : les événements Worksheet"]
[null,null,null,null,null,null,null,null,null,"pour 1 Kg","SI(ESTVIDE(B11);C11/C26;SI(ESTVIDE(C11);B11/C26;(C11*B11)/C26))",null,null,null,null,null,"❽  Nombre de portions prévues par l'Auteur",null,null,null,null,null,null,null,"Lien>","https://www.exceltip.com/events-in-vba/the-worksheet-events-in-excel-vba.html"]
[null,null,"❹ Référence Auteur",null,null,null,null,null,null,"Kg","E11*F8",null,null,null,null,null,"Poids total Auteur ⑨ somme des colonnes ❺  Poids",null,null,null,null,null,null,null,"Lien>","https://www.excel-pratique.com/fr/vba/evenements_feuille"]
[null,null,null,null,null,null,null,null,null,"Galettes","SI(ESTVIDE(B11);C11/C26*H8;SI(ESTVIDE(C11);B11/(C26*H8);(C11*B11)/(C26*H8)))",null,null,null,null,null,"formule utilisée","SI(ESTVIDE(B34);C34;B34*C34)+SI(ESTVIDE(B35);C35;B35*C35) etc.."]
[null,null,"❺ Nb de portions prévues par l'Auteur de la recette",null,null,null,null,null,null,null,null,null,null,null,null,null,"cette formule multiplie les  Unités ❹  mais n'additionne que les Poids ❺",null,null,null,null,null,null,null,"lien >","Les unités pifométriques"]
[null,null,null,null,null,null,null,null,null,"Cours VBA : les événements Worksheet"]
[null,null,null,null,null,null,"< Largeurs de colonnes",null,null,"Lien>","https://www.exceltip.com/events-in-vba/the-worksheet-events-in-excel-vba.html",null,null,null,null,null,"⑩ poids pour 1 portion",null,null,null,null,null,null,null,"Impression Portrait 1 recette par feuille A4"]
[null,null,"Vous pouvez augmenter ou diminuer le poids pour une galette en g ⑥ en augmentant ou diminuant le Nb.portions prévues ❺",null,null,null,null,null,null,"Lien>","https://www.excel-pratique.com/fr/vba/evenements_feuille",null,null,null,null,null,"Vous pouvez intervenir sur le poids portion ⑩ en augmentant ou en diminuant le nombre de portions ❽"]
[null,null,null,null,null,null,null,null,null,null,null,null,null,null,null,null,null,null,null,null,null,null,null,null,{"$f":"\"Page \"&_xlfn.SHEET()&\" sur \"&_xlfn.SHEETS()","v":"Page 2 sur 16"}]
[null,null,null,null,null,null,null,null,null,"lien >","Les unités pifométriques"]
[null,null,null,null,null,null,null,null,null,null,null,null,null,null,null,null,"⓫ Combien de Portions voulez vous faire",null,null,null,null,null,null,"Avant de saisir quoi que ce soit dans une cellule - cliquez dessus pour vérifier qu'il n'y ait pas de formule"]
[null,null,"❼ Dupliquer pour :",null,null,null,null,null,null,"Impression Portrait 1 recette par feuille A4",null,null,null,null,null,null,null,"⑫ Poids à fabriquer = ⑩ X ⓫"]
[null,null,"vous avez le choix pour un poids ou pour un nombre de crêpes",null,null,null,null,null,null,null,null,null,null,null,null,null,null,"⑬ Contrôle Total saisi somme des colonnes ⑦ Quantités"]
[null,null,null,null,null,null,null,null,null,{"$f":"\"Page \"&_xlfn.SHEET()&\" sur \"&_xlfn.SHEETS()","v":"Page 2 sur 16"},null,null,null,null,null,null,"formule utilisée","SI(ESTNUM(C34);E34)+SI(ESTNUM(C35);E35) etc.."]
[null,null,"après avoir saisi le poids de votre garniture ❽",null,null,null,null,null,null,null,null,null,null,null,null,null,"cette formule n'additionne que les quantités ⑦ à condition qu'il y ait eu un nombre saisi en  Poids ❺ "]
[null,null,null,null,null,null,null,null,null,"PHASES ESSENTIELLES  DE PROGRESSION"]
[null,null,"⑨ AUTEUR  : de la recette",null,null,null,null,null,null,"soyez concis 1 verbe = 1 action",null,null,null,null,null,null,"autrement dit elle ne mélange pas ❹ Unités et ❺  Poids sinon allez expliquer à Excel qu'1 œuf ne fait pas 1 Kg"]
[null,null,null,null,null,null,null,null,null,"Utilisez le vocabulaire professionnel"]
[null,null,null,null,null,null,null,null,null,"la numérotation est automatique"]
[null,null,"⑩ saisissez le lien internet de la recette ou de l'Auteur",null,null,null,null,null,null,null,"lorsque vous saisissez du texte",null,null,null,null,null,"④ PHASES ESSENTIELLES  DE PROGRESSION"]
[null,null,null,null,null,null,null,null,null,"dans la colonne C",null,null,null,null,null,null,"soyez concis 1 verbe = 1 action"]
[null,null,10,10,10,10,null,null,null,null,"si vous ne voulez pas de numérotation",null,null,null,null,null,"Utilisez le vocabulaire professionnel"]
[null,null,null,null,null,null,null,null,null,null,"saisissez votre texte dans la colonne D",null,null,null,null,null,"la numérotation est automatique"]
[null,null,null,null,null,null,null,null,null,"formule utilisée : SI(ESTVIDE(C30);\"\";GRANDE.VALEUR(B29:B29;1)+1)",null,null,null,null,null,null,null,"lorsque vous saisissez du texte"]
[null,null,null,null,null,null,null,null,null,null,null,null,null,null,null,null,"dans la colonne C ou dans la colonne L"]
[null,null,null,null,null,null,null,null,null,null,null,null,null,null,null,null,null,"si vous ne voulez pas de numérotation"]
[null,null,null,null,null,null,null,null,null,null,null,null,null,null,null,null,null,"saisissez votre texte dans la colonne D ou K"]
[null,null,null,null,null,null,null,null,null,null,null,null,null,null,null,null,"formule utilisée :"]
[null,null,null,null,null,null,null,null,null,null,null,null,null,null,null,null,"colonne B"]
[null,null,null,null,null,null,null,null,null,null,null,null,null,null,null,null,"SI(ESTVIDE(C27);\"\";GRANDE.VALEUR(B16:B26;1)+1)",null,null,null,"Colonne M"]
[null,null,null,null,null,null,null,null,null,null,null,null,null,null,null,null,null,null,null,null,"SI(ESTVIDE(L27);\"\";GRANDE.VALEUR(M15:M26;1)+1)"]
[null,null,null,null,null,null,null,null,null,null,null,null,null,null,null,null,12,12,19,12,12,"< Largeurs de colonnes"]
[]
[null,null,null,null,null,null,null,null,null,null,null,null,null,null,null,null,null,null,null,null,null,null,null,null,null,null,null,null,"FIN"]
[null,null,null,null,null,null,null,null,null,null,null,null,null,null,null,null,null,null,null,null,null,null,null,null,null,null,null,null,{"$f":"ADDRESS(ROW(),COLUMN(),4)","v":"AC58"}]

{"sheet":"Comment copier-coller","index":2,"n_rows":64,"n_cols":11,"rows_kept":64,"cut":false,"hidden":false,"merged":[]}
[]
[]
[null,null,"Si vous êtes dans un classeur xlsm c'est que certaines feuilles contiennent du code VBA  dans Worksheet"]
[null,null,"et si vous voulez coller quoi que ce soit dans la feuille vous devez procéder comme suit : "]
[null,null,null,"1 clic droit sur le ruban en haut de l'écran (personnaliser le ruban)"]
[]
[]
[]
[]
[]
[]
[]
[null,null,null,"2 cocher Développeur OK"]
[null,null,null,"3 cliquer sur le logo Mode de création"]
[]
[]
[]
[]
[null,null,null,"maintenant vous pouvez copier coller ce que vous voulez"]
[null,null,null,"ensuite décliquez sur le logo et décochez le développeur si vous n'en avez plus besoin"]
[]
[null,null,null,null,null,null,null,null,null,null,{"$f":"\"Page \"&_xlfn.SHEET()&\" sur \"&_xlfn.SHEETS()","v":"Page 3 sur 16"}]
[]
[]
[]
[]
[]
[]
[]
[]
[]
[]
[]
[]
[]
[]
[]
[]
[]
[]
[]
[]
[]
[]
[]
[]
[]
[null,null,"Pour coller sur une feuille contenant du code VBA"]
[]
[null,null,"Mettez en surbrillance la ligne et la colonne actives dans Excel"]
[]
[null,null,"Voici les étapes pour mettre en surbrillance la ligne et la colonne actives lors de la sélection :"]
[]
[null,null,"Sélectionnez l'ensemble de données dans lequel vous mettez en surbrillance la ligne/colonne active."]
[null,null,"Allez dans l'onglet Accueil."]
[null,null,"Cliquez sur Mise en forme conditionnelle, puis sur Nouvelle règle."]
[null,null,"Dans la boîte de dialogue Nouvelle règle de formatage, sélectionnez \"Utiliser une formule pour déterminer les cellules à formater\"."]
[null,null,"Dans le champ Description de la règle, saisissez la formule : =OR(CELL(“col”)=COLUMN(),CELL(“row”)=ROW())"]
[null,null,"Cliquez sur le bouton Format et spécifiez le formatage (la couleur dans laquelle vous souhaitez mettre la ligne/colonne en surbrillance)."]
[null,null,"Cliquez sur OK."]
[]
[null,null,"Les étapes ci-dessus ont pris soin de mettre en surbrillance la ligne active et la colonne active (avec la même couleur) chaque fois qu'il y a un événement de changement de sélection ."]
[]
[null,null,"Cependant, pour que cela fonctionne, vous devez placer un simple code VBA dans le worksheet"]

{"sheet":"Code VBA","index":3,"n_rows":25,"n_cols":15,"rows_kept":25,"cut":false,"hidden":false,"merged":[]}
[]
[]
[null,null,"Mettre en surbrillance la ligne et la colonne actives dans Excel"]
[null,null,"Comment faire :"]
[]
[null,null,"Première étape"]
[null,null,"cliquez sur l'onglet de la page "]
[null,null,"clic droit Visualiser le code et coller les 3 lignes suivantes dans Worksheet"]
[null,null,"Private Sub Worksheet_SelectionChange(ByVal Target As Range)"]
[null,null,"  Calculate"]
[null,null,"End Sub"]
[]
[null,null,"pour les couleurs c'est de la mise en forme conditionnelle avec cette formule :"]
[null,null,"=OU(LIGNE()=CELLULE(\"ligne\");COLONNE()=CELLULE(\"colonne\"))"]
[]
[null,null,"Comment faire :"]
[]
[null,null,"Sélectionnez l'ensemble de données dans lequel vous mettez en surbrillance la ligne/colonne active."]
[null,null,"Allez dans l'onglet Accueil."]
[null,null,"Cliquez sur Mise en forme conditionnelle, puis sur Nouvelle règle."]
[null,null,"Dans la boîte de dialogue Nouvelle règle de formatage, sélectionnez \"Utiliser une formule pour déterminer les cellules à formater\"."]
[null,null,"Dans le champ Description de la règle, saisissez la formule : '       =OU(LIGNE()=CELLULE(\"ligne\");COLONNE()=CELLULE(\"colonne\"))"]
[null,null,"Cliquez sur le bouton Format et spécifiez le formatage (la couleur dans laquelle vous souhaitez mettre la ligne/colonne en surbrillance)."]
[null,null,"Cliquez sur OK."]
[null,null,null,null,null,null,null,null,null,null,null,null,null,null,{"$f":"\"Page \"&_xlfn.SHEET()&\" sur \"&_xlfn.SHEETS()","v":"Page 4 sur 16"}]

{"sheet":"qu'est-ce qu'un \"Postit\"","index":4,"n_rows":84,"n_cols":27,"rows_kept":84,"cut":false,"hidden":false,"merged":[[55,18,56,21],[59,19,62,24],[75,18,75,21],[33,19,34,25],[37,22,38,22],[37,23,38,23],[42,19,43,20],[45,19,45,21],[45,22,45,25],[23,2,26,2],[23,19,23,20],[1,0,2,16],[6,18,6,21],[14,19,14,21],[15,19,15,21],[21,19,21,20]]}
[3,{"$f":"CELL(\"largeur\",B1)","v":11},11,11,11,11,11,11,11,11,11,11,11,11,11,11,{"$f":"CELL(\"largeur\",Q1)","v":11},"<fonction   CELLULE(\"largeur\";Q1)"]
["Mise à jour du 2 Décembre 2021"]
[]
[null,null,null,null,null,null,null,null,null,null,null,null,null,null,null,{"$f":"\"Page \"&_xlfn.SHEET()&\" sur \"&_xlfn.SHEETS()","v":"Page 5 sur 16"}]
[]
[]
[null,null,"QU'EST-CE QU'UNE FICHE DE FABRICATION  DE TYPE \"POSTIT\"©",null,null,null,null,null,null,null,null,null,null,null,null,null,null,null,"SERVICE AU POIDS Explication"]
[null,null,"Tel un Postit © c'est une fiche Excel autonome facilement copiable et transposable dans n'importe quelle feuille"]
[null,null,"Lien >","Mettez la collaboration au coeur de votre environnement de travail",null,null,null,null,null,null,null,null,null,null,null,null,null,null,null,"Cela demande un peu plus d'attention que pour le service à la portion"]
[null,null,"\"POSTIT\"   QUEL INTÉRÊT ",null,null,null,null,null,null,null,null,null,null,null,null,null,null,null,null,"les poids - les cuillères à café le nombre de pièces : tout est mélangé"]
[null,null,"Chaque postit étant indépendant vous pouvez  le copier et le coller dans n'importe quelle feuille Excel ",null,null,null,null,null,null,null,null,null,null,null,null,null,null,null,null,"si bien que vous obtenez un poids total ④ complètement faux"]
[null,null,"pour vous constituer un répertoire",null,null,null,null,null,null,null,null,null,null,null,null,null,null,null,null,"c'est pourquoi ② vous avez 2 colonnes 1 pour les (unités ou quantités)  l'autre pour les poids"]
[null,null,"Vous pouvez assembler plusieurs postit(s) sur une même feuille pour créer votre recette"]
[null,null,"Exemple : pour une recette de gateau…allez chercher dans vos répertoires la recette du biscuit qui vous convient",null,null,null,null,null,null,null,null,null,null,null,null,null,null,null,null,"Formule :"]
[null,null," le mieux ajoutez une ou deux crèmes qui vont bien et terminez en ajoutant un postit éléments de décor",null,null,null,null,null,null,null,null,null,null,null,null,null,null,null,null,"Quantité de chaque produit  ",null,null,"X par ce que vous voulez dupliquer ⑥"]
[null,null,"Idem pour des recettes de cuisine faites des répertoires :",null,null,null,null,null,null,null,null,null,null,null,null,null,null,null,null,"❺ Référence Auteur"]
[null,null,"de garnitures aromatiques de cuisson"]
[null,null,"de sauces diverses et variées",null,null,null,null,null,null,null,null,null,null,null,null,null,null,null,null,"Convertissez tout de suite les volumes en poids sur la base de 1L = 1Kg "]
[null,null," de garnitures de finitions ou de décor",null,null,null,null,null,null,null,null,null,null,null,null,null,null,null,null,"¼ de botte de fines herbes -  allez expliquer cela à Excel (0.25)"]
[null,null,"Faites \"votre marché\" dans vos répertoires et assemblez le tout sur une même feuille Excel",null,null,null,null,null,null,null,null,null,null,null,null,null,null,null,null,"½ citron 0.5     ¾ de litre 0.75"]
[null,null,"comment copier un \"Postit\" : cliquez sur la cellule ICI dans l'angle gauche puis déportez la souris vers la droit le postit ",null,null,null,null,null,null,null,null,null,null,null,null,null,null,null,null,"Exemple"]
[null,null,"est sélectionné  il ne vous reste plus qu'a le copier et le coller dans votre répertoire",null,null,null,null,null,null,null,null,null,null,null,null,null,null,null,null,"Qt. Auteur "]
[null,null,null,null,null,null,null,null,null,null,null,null,null,null,"ne sont \"postit\" que les fiches avec cellule ","ICI","ICI",null,null,"Unités","Poids ",null,null,"Denrées",null,"Quoi"]
[null,null,"Liens >","Comment créer une Arborescence de dossiers",null,null,null,null,null,null,null,null,null,null,null,null,null,null,null,"②",null,null,null,"①",null,"③"]
[null,null,null,"La méthode simple pour classer ses dossiers, fichiers et documents sur son ordinateur",null,null,null,null,null,null,null,null,null,null,null,null,null,null,null,0.25,null,null,null,"¼ de botte de fines herbe",{"$f":"IF(ISBLANK(T25),U25,IF(ISBLANK(U25),T25,T25*U25))","v":0.25},"bottes"]
[null,null,null,"Organiser vos documents (nommer, stocker, classer…)",null,null,null,null,null,null,null,null,null,null,null,null,null,null,null,0.5,null,null,null,"½ citron",{"$f":"IF(ISBLANK(T26),U26,IF(ISBLANK(U26),T26,T26*U26))","v":0.5},"citrons"]
[null,null,null,"Windows 10 : 15 astuces pour maîtriser l’explorateur de fichiers comme un pro",null,null,null,null,null,null,null,null,null,null,null,null,null,null,null,0.75,null,null,null,"¾ de litre",0.75,"litres"]
[null,null,null,null,null,null,null,null,null,null,null,null,null,null,null,null,null,null,null,10,null,null,null,"jaunes d'œufs",10,"jaunes"]
[null,null,"Bonne utilisation. A vous de faire évoluer ces documents…et n'hésitez pas à tramsmettre vos savoirs faire……",null,null,null,null,null,null,null,null,null,null,null,null,null,null,null,null,15,0.03,null,null,"blancs d'œufs de 30g",0.44999999999999996,"kg"]
[null,null,"pour aider les jeunes en formation ou donner des idées à vos collègues des métiers de bouche",null,null,null,null,null,null,null,null,null,null,null,null,null,null,null,null,null,0.2,null,null,"OU jaunes d'œufs liquides",0.2,"kg"]
[null,null,"Joël Leboucher",null,null,null,null,null,null,null,null,null,null,null,null,null,null,null,null,null,0.125,null,null,"farine",{"$f":"IF(ISBLANK(T31),U31,IF(ISBLANK(U31),T31,T31*U31))","v":0.125},"kg"]
[null,null,"Adaptation 2016 : Joël Leboucher..UPRT \"Union des Personnels de la Restauration Territoriale\"  membre du réseau RESTAU'CO"]
[null,null,null,null,null,null,null,null,null,null,null,null,null,null,null,null,null,null,null,"❺ Référence Auteur "]
[null,null,null,null,null,null,null,null,null,null,null,null,null,null,null,null,null,null,null,"soit vous saisisez le total ④ dans la cellule ❺ ou mettez les 2 cellules en liaison en liaison  ="]
[]
[null,null,null,null,null,null,null,null,null,null,null,null,null,null,null,null,null,null,null,"soit vous faites le choix de dupliquer la recette à partir d'une denrée Exemple farine"]
[null,null,null,null,null,null,null,null,null,null,null,null,null,null,null,null,null,null,null,"❺ Référence Auteur ",null,null,"⑤ Dupliqué pour"]
[null,null,null,null,null,null,null,null,null,null,null,null,null,null,null,null,null,null,null,0.125,"Kg de farine",null,1,{"$f":"U38","v":"Kg de farine"}]
[]
[null,null,null,null,null,null,null,null,null,null,null,null,null,null,null,null,null,null,null,"OU Autre portions.couverts.plaques etc"]
[]
[null,null,null,null,null,null,null,null,null,null,null,null,null,null,null,null,null,null,null,"Si vous supprimez des lignes inutiles"]
[null,null,null,null,null,null,null,null,null,null,null,null,null,null,null,null,null,null,null,"ne pas supprimer ces 4 lignes",null,"❹ >","SI(ESTVIDE(#REF!);#REF!;#REF!*#REF!)"]
[null,null,null,null,null,null,null,null,null,null,null,null,null,null,null,null,null,null,null,null,null,"Supprimez les erreurs #REF! dans la barre de formule"]
[]
[null,null,null,null,null,null,null,null,null,null,null,null,null,null,null,null,null,null,null,"saisissez le NOM DE LA RECETTE",null,null,"ICI EGALEMENT"]
[null,null,null,null,null,null,null,null,null,null,null,null,null,null,null,null,null,null,null,null,null,"Traçabilité","Auteur >"]
[null,null,null,null,null,null,null,null,null,null,null,null,null,null,null,null,null,null,null,null,null,"si vous utilisez cette recette pour une","< recette pour CHARLOTTE POIRE CARAMEL"]
[null,null,null,null,null,null,null,null,null,null,null,null,null,null,null,null,null,null,null,null,null,"autre utilisation vous aurez une traçabilité"]
[null,null,null,null,null,null,null,null,null,null,null,null,null,null,null,null,null,null,null,null,null,null,"Préparation >",2,"Cuisson >",2]
[null,null,null,null,null,null,null,null,null,null,null,null,null,null,null,null,null,null,null,null,null,null,null,"saissez un nombre la cellule est formatée pour ajouter mn"]
[]
[null,null,null,null,null,null,null,null,null,null,null,null,null,null,null,null,null,null,"Ce modèle de fiche s'utilise comme un \"Postit\""]
[null,null,null,null,null,null,null,null,null,null,null,null,null,null,null,null,null,null,"Exemples que des recettes sans procédures - des fiches avec procédures en dessous etc..soyez imaginatif"]
[]
[null,null,null,null,null,null,null,null,null,null,null,null,null,null,null,null,null,null,"Lien internet > vous pouvez coller des liens internet pour retrouver une recette sur le web",null,null,null,"Saisissez votre texte faire court et concis"]
[null,null,null,null,null,null,null,null,null,null,null,null,null,null,null,null,null,null,null,null,null,null,"1 verbe = 1 action"]
[]
[]
[null,null,null,null,null,null,null,null,null,null,null,null,null,null,null,null,null,null,null,"Recette et progression peuvent être utilisés comme \"postits\" indépendants.Vous pouvez donc les copier/déplacer comme vous le voulez"]
[]
[]
[]
[]
[null,null,null,null,null,null,null,null,null,null,null,null,null,null,null,null,null,null,null,"Option d'affichage : décocher : Afficher un zéro dans les cellules qui ont une valeur nulle"]
[]
[]
[]
[]
[]
[]
[]
[]
[]
[]
[null,null,null,null,null,null,null,null,null,null,null,null,null,null,null,null,null,null,"SERVICE A LA PORTION"]
[]
[null,null,null,null,null,null,null,null,null,null,null,null,null,null,null,null,null,null,null,"Vous pouvez détourner et simplifier l'utilisation de cette fiche "]
[null,null,null,null,null,null,null,null,null,null,null,null,null,null,null,null,null,null,null,"en cellule ❺ saisissez un nombre de portions - de plaques -de louches"]
[null,null,null,null,null,null,null,null,null,null,null,null,null,null,null,null,null,null,null," ou tout ce que vous voulez"]
[null,null,null,null,null,null,null,null,null,null,null,null,null,null,null,null,null,null,null,"en cellule ⑥ saisissez ce que vous voulez obtenir"]
[]
[null,null,null,null,null,null,null,null,null,null,null,null,null,null,null,null,null,null,12,12,12,12,12,12,12,12,"FIN"]
[null,null,null,null,null,null,null,null,null,null,null,null,null,null,null,null,null,null,null,null,null,null,null,null,null,null,{"$f":"ADDRESS(ROW(),COLUMN(),4)","v":"AA84"}]

{"sheet":"Modèle.Portrait.1","index":5,"n_rows":98,"n_cols":21,"rows_kept":98,"cut":false,"hidden":false,"merged":[[81,0,82,0],[81,1,82,1],[81,2,82,6],[81,7,82,7],[84,0,85,0],[84,1,85,1],[84,2,85,6],[84,7,85,7],[96,0,97,0],[96,1,97,1],[96,2,97,6],[96,7,97,7],[87,0,88,0],[87,1,88,1],[87,2,88,6],[87,7,88,7],[90,0,91,0],[90,1,91,1],[90,2,91,6],[90,7,91,7],[93,0,94,0],[93,1,94,1],[93,2,94,6],[93,7,94,7],[75,2,76,6],[75,7,76,7],[78,0,79,0],[78,1,79,1],[78,2,79,6],[78,7,79,7],[75,0,76,0],[75,1,76,1],[69,0,70,0],[69,1,70,1],[69,2,70,6],[69,7,70,7],[72,0,73,0],[72,1,73,1],[72,2,73,6],[72,7,73,7],[63,0,64,0],[63,1,64,1],[63,2,64,6],[63,7,64,7],[66,0,67,0],[66,1,67,1],[66,2,67,6],[66,7,67,7],[57,0,58,0],[57,1,58,1],[57,2,58,6],[57,7,58,7],[60,0,61,0],[60,1,61,1],[60,2,61,6],[60,7,61,7],[51,0,52,0],[51,1,52,1],[51,2,52,6],[51,7,52,7],[54,0,55,0],[54,1,55,1],[54,2,55,6],[54,7,55,7],[48,0,49,0],[48,1,49,1],[48,2,49,6],[48,7,49,7],[46,0,47,0],[46,1,47,1],[46,2,47,6],[46,7,47,7],[5,16,8,19],[6,9,7,12],[9,9,9,12],[10,9,10,12],[10,16,13,19],[3,14,25,14],[14,9,14,12],[3,0,44,0],[3,1,3,3],[3,6,3,7],[3,9,4,12],[5,9,5,12],[16,9,17,12],[24,9,26,12],[27,9,29,12],[32,9,33,12],[34,9,35,12],[36,9,37,12],[39,9,40,12],[43,1,43,7],[1,14,2,14],[1,0,2,0],[1,1,2,1],[1,2,2,6],[1,7,2,7],[1,9,2,12]]}
[]
["ICI","① ","NOM DU PLAT",null,null,null,null,"N°5",null,"Récap du Mode d'emploi  de la fiche recette",null,null,null,null,"ICI"]
[]
["CETTE RECETTE EST A CLASSER DANS QUELLE FAMILLE","⑨ AUTEUR  :      ?",null,null,null,"Recette éditée le :",{"$f":"NOW()","v":"2021-12-20T19:39:32.240"},null,null,"Recette au poids et au NOMBRE DE GALETTES",null,null,null,null,"Sur la tranche des fiches indiquez : CETTE RECETTE EST A CLASSER DANS QUELLE FAMILLE",{"$f":"O4","v":"Sur la tranche des fiches indiquez : CETTE RECETTE EST A CLASSER DANS QUELLE FAMILLE"}]
[null,"❹  Référence Auteur"]
[null,{"$f":"C26","v":0.55000000000000004},"Kg",null,null,null,"❽ poids d'une portion en g >",120,null,"à saisir",null,null,null,null,null,null,"J'ai volontairement augmenté le nombre de portions ❺ pour diminuer le poids pour 1 galette en g ⑥ à vous d'ajuster selon votre clientèle"]
[null,15,"< Nb.portions prévues ❺",null,null,"❼ A dupliquer pour",null,null,null,"❶ NOM de la recette a saisir et N° ou lettre Alpha"]
[null,{"$f":"(B6/B7)*1000","v":36.666666666666664},"< poids pour une galette en g ⑥",null,null,2.5,10,{"$f":"H6*G8/1000","v":1.2}]
[null,"❷ Unités","❷  Poids","❷ Compositon","pour 1 Kg","Kg","Galettes","❸ Quoi",null,"❷ Unités.Poids.Compositon"]
[null,null,null,null,{"$f":"IF(ISBLANK(B10),C10/C26,IF(ISBLANK(C10),B10/C26,(C10*B10)/C26))","v":0},{"$f":"E10*F8","v":0},{"$f":"IF(ISBLANK(B10),C10/C26*H8,IF(ISBLANK(C10),B10/(C26*H8),(C10*B10)/(C26*H8)))","v":0},null,null,"Poids à saisir en Kg"]
[null,8,0.05,"œufs",{"$f":"IF(ISBLANK(B11),C11/C26,IF(ISBLANK(C11),B11/C26,(C11*B11)/C26))","v":0.72727272727272729},{"$f":"E11*F8","v":1.8181818181818183},{"$f":"+IF(ISBLANK(B11),C11/C26*H8,IF(ISBLANK(C11),B11/(C26*H8),(C11*B11)/(C26*H8)))","v":0.60606060606060608},"Kg",null,"Exep. 3 œufs de 0.050",null,null,null,null,null,null,"le surlignage des lignes et colonnes s'obtient avec une Mise en forme conditionnelle MFC avec cette formule =OU(LIGNE()=CELLULE(\"ligne\");COLONNE()=CELLULE(\"colonne\")) "]
[null,null,0.15,"ou œufs liquides",{"$f":"IF(ISBLANK(B12),C12/C26,IF(ISBLANK(C12),B12/C26,(C12*B12)/C26))","v":0.27272727272727271},{"$f":"E12*F8","v":0.68181818181818177},{"$f":"IF(ISBLANK(B12),C12/C26*H8,IF(ISBLANK(C12),B12/(C26*H8),(C12*B12)/(C26*H8)))","v":0.32727272727272722},"Kg",null,null,"❷ Unités","❷  Poids","❸ Quoi"]
[null,3,null,"œufs",{"$f":"IF(ISBLANK(B13),C13/C26,IF(ISBLANK(C13),B13/C26,(C13*B13)/C26))","v":5.4545454545454541},{"$f":"E13*F8","v":13.636363636363635},{"$f":"IF(ISBLANK(B13),C13/C26*H8,IF(ISBLANK(C13),B13/(C26*H8),(C13*B13)/(C26*H8)))","v":4.545454545454545},"œufs",null,null,3,0.05,"kg"]
[null,null,null,null,{"$f":"IF(ISBLANK(B14),C14/C26,IF(ISBLANK(C14),B14/C26,(C14*B14)/C26))","v":0},{"$f":"E14*F8","v":0},{"$f":"IF(ISBLANK(B14),C14/C26*H8,IF(ISBLANK(C14),B14/(C26*H8),(C14*B14)/(C26*H8)))","v":0},null,null,"ou",3,null,"Œufs"]
[null,null,null,null,{"$f":"IF(ISBLANK(B15),C15/C26,IF(ISBLANK(C15),B15/C26,(C15*B15)/C26))","v":0},{"$f":"E15*F8","v":0},{"$f":"IF(ISBLANK(B15),C15/C26*H8,IF(ISBLANK(C15),B15/(C26*H8),(C15*B15)/(C26*H8)))","v":0},null,null,"ou œufs liquides",null,null,null,null,null,null,"et cette commande de code dans Worksheet"]
[null,null,null,null,{"$f":"IF(ISBLANK(B16),C16/C26,IF(ISBLANK(C16),B16/C26,(C16*B16)/C26))","v":0},{"$f":"E16*F8","v":0},{"$f":"+IF(ISBLANK(B16),C16/C26*H8,IF(ISBLANK(C16),B16/(C26*H8),(C16*B16)/(C26*H8)))","v":0},null,null,null,null,0.15,"kg",null,null,null," Private Sub Worksheet_SelectionChange(ByVal Target As Range)  "]
[null,null,null,null,{"$f":"IF(ISBLANK(B17),C17/C26,IF(ISBLANK(C17),B17/C26,(C17*B17)/C26))","v":0},{"$f":"E17*F8","v":0},{"$f":"IF(ISBLANK(B17),C17/C26*H8,IF(ISBLANK(C17),B17/(C26*H8),(C17*B17)/(C26*H8)))","v":0},null,null,"❸ Lorsque vous avez des produits à l'unité réduisez les décimales pour une meilleure lecture",null,null,null,null,null,null,"  Calculate"]
[null,null,null,null,{"$f":"IF(ISBLANK(B18),C18/C26,IF(ISBLANK(C18),B18/C26,(C18*B18)/C26))","v":0},{"$f":"E18*F8","v":0},{"$f":"IF(ISBLANK(B18),C18/C26*H8,IF(ISBLANK(C18),B18/(C26*H8),(C18*B18)/(C26*H8)))","v":0},null,null,null,null,null,null,null,null,null,"End Sub"]
[null,null,null,null,{"$f":"IF(ISBLANK(B19),C19/C26,IF(ISBLANK(C19),B19/C26,(C19*B19)/C26))","v":0},{"$f":"E19*F8","v":0},{"$f":"IF(ISBLANK(B19),C19/C26*H8,IF(ISBLANK(C19),B19/(C26*H8),(C19*B19)/(C26*H8)))","v":0},null,null,"utilisez le pinceau pour ce faire",null,null,null,null,null,null,15,15,15,15,"largeur de colonnes"]
[null,null,null,null,{"$f":"IF(ISBLANK(B20),C20/C26,IF(ISBLANK(C20),B20/C26,(C20*B20)/C26))","v":0},{"$f":"E20*F8","v":0},{"$f":"IF(ISBLANK(B20),C20/C26*H8,IF(ISBLANK(C20),B20/(C26*H8),(C20*B20)/(C26*H8)))","v":0},null,null,"pour 1 Kg","Kg","Galettes"]
[null,null,null,null,{"$f":"IF(ISBLANK(B21),C21/C26,IF(ISBLANK(C21),B21/C26,(C21*B21)/C26))","v":0},{"$f":"E21*F8","v":0},{"$f":"IF(ISBLANK(B21),C21/C26*H8,IF(ISBLANK(C21),B21/(C26*H8),(C21*B21)/(C26*H8)))","v":0},null,null,1,1,1.2,null,null,null,null," total saisi >","SI(ESTVIDE(Q5);R5;Q5*R5)+SI(ESTVIDE(Q6);R6;Q6*R6) etc…"]
[null,null,null,null,{"$f":"IF(ISBLANK(B22),C22/C26,IF(ISBLANK(C22),B22/C26,(C22*B22)/C26))","v":0},{"$f":"E22*F8","v":0},{"$f":"IF(ISBLANK(B22),C22/C26*H8,IF(ISBLANK(C22),B22/(C26*H8),(C22*B22)/(C26*H8)))","v":0},null,null,null,null,null,null,null,null,null,"pour 1 Kg","SI(ESTVIDE(B11);C11/C26;SI(ESTVIDE(C11);B11/C26;(C11*B11)/C26))"]
[null,null,null,null,{"$f":"IF(ISBLANK(B23),C23/C26,IF(ISBLANK(C23),B23/C26,(C23*B23)/C26))","v":0},{"$f":"E23*F8","v":0},{"$f":"IF(ISBLANK(B23),C23/C26*H8,IF(ISBLANK(C23),B23/(C26*H8),(C23*B23)/(C26*H8)))","v":0},null,null,"❹ Référence Auteur",null,null,null,null,null,null,"Kg","E11*F8"]
[null,null,null,null,{"$f":"IF(ISBLANK(B24),C24/C26,IF(ISBLANK(C24),B24/C26,(C24*B24)/C26))","v":0},{"$f":"E24*F8","v":0},{"$f":"IF(ISBLANK(B24),C24/C26*H8,IF(ISBLANK(C24),B24/(C26*H8),(C24*B24)/(C26*H8)))","v":0},null,null,null,null,null,null,null,null,null,"Galettes","SI(ESTVIDE(B11);C11/C26*H8;SI(ESTVIDE(C11);B11/(C26*H8);(C11*B11)/(C26*H8)))"]
[null,null,null,null,{"$f":"IF(ISBLANK(B25),C25/C26,IF(ISBLANK(C25),B25/C26,(C25*B25)/C26))","v":0},{"$f":"E25*F8","v":0},{"$f":"IF(ISBLANK(B25),C25/C26*H8,IF(ISBLANK(C25),B25/(C26*H8),(C25*B25)/(C26*H8)))","v":0},null,null,"❺ Nb de portions prévues par l'Auteur de la recette"]
[null," total saisi >",{"$f":"IF(ISBLANK(B10),C10,B10*C10)+IF(ISBLANK(B11),C11,B11*C11)+IF(ISBLANK(B12),C12,B12*C12)+IF(ISBLANK(B13),C13,B13*C13)+IF(ISBLANK(B14),C14,B14*C14)+IF(ISBLANK(B15),C15,B15*C15)+IF(ISBLANK(B16),C16,B16*C16)+IF(ISBLANK(B17),C17,B17*C17)+IF(ISBLANK(B18),C18,B18*C18)+IF(ISBLANK(B19),C19,B19*C19)+IF(ISBLANK(B20),C20,B20*C20)+IF(ISBLANK(B21),C21,B21*C21)+IF(ISBLANK(B22),C22,B22*C22)+IF(ISBLANK(B23),C23,B23*C23)+IF(ISBLANK(B24),C24,B24*C24)+IF(ISBLANK(B25),C25,B25*C25)","v":0.55000000000000004},null,0,0,null,null,null,null,null,null,null,null,null,null,"Cours VBA : les événements Worksheet"]
[null,"⑩ Lien>",null,null,null,null,null,null,null,null,null,null,null,"< Largeurs de colonnes",null,null,"Lien>","https://www.exceltip.com/events-in-vba/the-worksheet-events-in-excel-vba.html"]
[null,{"$f":"CELL(\"filename\",M2)","v":"E:\\Joël Leboucher\\Téléchargements\\[GA-modele.de.fiche.pour.galettes.xlsm]Modèle.Portrait.1"},null,null,null,null,null,null,null,"Vous pouvez augmenter ou diminuer le poids pour une galette en g ⑥ en augmentant ou diminuant le Nb.portions prévues ❺",null,null,null,null,null,null,"Lien>","https://www.excel-pratique.com/fr/vba/evenements_feuille"]
[null,0,"MÉTHODE D'EXÉCUTION"]
[null,{"$f":"IF(ISBLANK(C30),\"\",LARGE(B29:B29,1)+1)","v":1},"soyez concis 1 verbe = 1 action",null,null,null,null,null,null,null,null,null,null,null,null,null,"lien >","Les unités pifométriques"]
[null,{"$f":"IF(ISBLANK(C31),\"\",LARGE(B29:B30,1)+1)","v":2},"Utilisez le vocabulaire professionnel"]
[null,{"$f":"IF(ISBLANK(C32),\"\",LARGE(B29:B31,1)+1)","v":3},"la numérotation est automatique",null,null,null,null,null,null,"❼ Dupliquer pour :",null,null,null,null,null,null,"Impression Portrait 1 recette par feuille A4"]
[null,{"$f":"IF(ISBLANK(C33),\"\",LARGE(B29:B32,1)+1)","v":""},null,"lorsque vous saisissez du texte",null,null,null,null,null,"vous avez le choix pour un poids ou pour un nombre de crêpes"]
[null,{"$f":"IF(ISBLANK(C34),\"\",LARGE(B29:B33,1)+1)","v":4},"dans la colonne C",null,null,null,null,null,null,null,null,null,null,null,null,null,{"$f":"\"Page \"&_xlfn.SHEET()&\" sur \"&_xlfn.SHEETS()","v":"Page 6 sur 16"}]
[null,{"$f":"IF(ISBLANK(C35),\"\",LARGE(B29:B34,1)+1)","v":""},null,"si vous ne voulez pas de numérotation",null,null,null,null,null,"après avoir saisi le poids de votre crêpe ❽"]
[null,{"$f":"IF(ISBLANK(C36),\"\",LARGE(B29:B35,1)+1)","v":""},null,"saisissez votre texte dans la colonne D ou +",null,null,null,null,null,null,null,null,null,null,null,null,"PHASES ESSENTIELLES  DE PROGRESSION"]
[null,{"$f":"IF(ISBLANK(C37),\"\",LARGE(B29:B36,1)+1)","v":""},null,null,null,null,null,null,null,"⑨ AUTEUR  : de la recette",null,null,null,null,null,null,"soyez concis 1 verbe = 1 action"]
[null,{"$f":"IF(ISBLANK(C38),\"\",LARGE(B29:B37,1)+1)","v":""},null,null,null,null,null,null,null,null,null,null,null,null,null,null,"Utilisez le vocabulaire professionnel"]
[null,{"$f":"IF(ISBLANK(C39),\"\",LARGE(B29:B38,1)+1)","v":""},null,null,null,null,null,null,null,null,null,null,null,null,null,null,"la numérotation est automatique"]
[null,{"$f":"IF(ISBLANK(C40),\"\",LARGE(B29:B39,1)+1)","v":""},null,null,null,null,null,null,null,"⑩ saisissez le lien internet de la recette ou de l'Auteur",null,null,null,null,null,null,null,"lorsque vous saisissez du texte"]
[null,{"$f":"IF(ISBLANK(C41),\"\",LARGE(B29:B40,1)+1)","v":""},null,null,null,null,null,null,null,null,null,null,null,null,null,null,"dans la colonne C"]
[null,{"$f":"+IF(ISBLANK(C42),\"\",LARGE(B29:B41,1)+1)","v":""},null,null,null,null,null,null,null,10,10,10,10,null,null,null,null,"si vous ne voulez pas de numérotation"]
[null,{"$f":"IF(ISBLANK(C43),\"\",LARGE(B29:B42,1)+1)","v":""},null,0,null,null,null,null,null,null,null,null,null,null,null,null,null,"saisissez votre texte dans la colonne D"]
[null,"Conception 1998 Cuisine centrale de Clamart Joël Leboucher - Adaptation 2009 Cuisine Centrale de Rochefort sur mer mise à jour décembre 2021 sur un document avec code VBA..de D.DEMILLY ",null,null,null,null,null,null,null,null,null,null,null,null,null,null,"formule utilisée : SI(ESTVIDE(C30);\"\";GRANDE.VALEUR(B29:B29;1)+1)"]
[null,9.14,9,30,10,9,11,11,"Largeurs de colonnes"]
[]
[null,null,"ENTETES DE RECHANGE"]
[]
[null,"① ","Servez vous du pinceau Mise en forme pour changer les couleurs d'entête des recettes ou collez celles-ci à la place",null,null,null,null,"Codes ou N°"]
[]
[]
["ICI","① ","DIVERS",null,null,null,null,"DIV001"]
[]
[]
["ICI","① ","brun PATISSERIE",null,null,null,null,"PAT001"]
[]
[]
["ICI","① ","bleu vert DESSERTS",null,null,null,null,"DES001"]
[]
[]
["ICI","① ","bleu LAITAGES FROMAGES",null,null,null,null,"LAI001"]
[]
[]
["ICI","① ","bleu moyen LAITAGES + FÉCULENTS",null,null,null,null,"LFC001"]
[]
[]
["ICI","① ","vert brillant ACCOMPAGNEMENT COMPOSÉS VERTS",null,null,null,null,"ACC001"]
[]
[]
["ICI","① ","orange PLATS COMPLETS",null,null,null,null,"PLC001"]
[]
[]
["ICI","① ","bleu ciel  POISSON",null,null,null,null,"POI001"]
[]
[]
["ICI","① ","or VOLAILLES",null,null,null,null,"VOL001"]
[]
[]
["ICI","① ","rouge VIANDE",null,null,null,null,"VIA001"]
[]
[]
["ICI","① ","rose PLAT PRINCIPAL",null,null,null,null,"PLA001"]
[]
[]
["ICI","① ","marron FÉCULENTS",null,null,null,null,"FEC001"]
[]
[]
["ICI","① ","citron vert CUIDITÉS",null,null,null,null,"CUI001"]
[]
[]
["ICI","① ","vert CRUDITÉS",null,null,null,null,"CRU001"]
[]
[]
["ICI","① ","violet  ENTRÉES CHAUDES",null,null,null,null,"ENT001"]
[]
[]
["ICI","① ","vert marin  ENTRÉES FROIDES",null,null,null,null,"ENT001",null,null,null,null,null,null,null,null,null,null,null,null,"FIN"]
[null,null,null,null,null,null,null,null,null,null,null,null,null,null,null,null,null,null,null,null,{"$f":"ADDRESS(ROW(),COLUMN(),4)","v":"U98"}]

{"sheet":"Modèle.Portrait.2.une.fiche","index":6,"n_rows":108,"n_cols":27,"rows_kept":108,"cut":false,"hidden":false,"merged":[[100,0,101,0],[100,1,101,1],[100,2,101,10],[100,11,101,12],[103,0,104,0],[103,1,104,1],[103,2,104,10],[103,11,104,12],[94,0,95,0],[94,1,95,1],[94,2,95,10],[94,11,95,12],[97,0,98,0],[97,1,98,1],[97,2,98,10],[97,11,98,12],[88,0,89,0],[88,1,89,1],[88,2,89,10],[88,11,89,12],[91,0,92,0],[91,1,92,1],[91,2,92,10],[91,11,92,12],[82,0,83,0],[82,1,83,1],[82,2,83,10],[82,11,83,12],[85,0,86,0],[85,1,86,1],[85,2,86,10],[85,11,86,12],[76,0,77,0],[76,1,77,1],[76,2,77,10],[76,11,77,12],[79,0,80,0],[79,1,80,1],[79,2,80,10],[79,11,80,12],[70,0,71,0],[70,1,71,1],[70,2,71,10],[70,11,71,12],[73,0,74,0],[73,1,74,1],[73,2,74,10],[73,11,74,12],[64,0,65,0],[64,1,65,1],[64,2,65,10],[64,11,65,12],[67,0,68,0],[67,1,68,1],[67,2,68,10],[67,11,68,12],[58,0,59,0],[58,1,59,1],[58,2,59,10],[58,11,59,12],[61,0,62,0],[61,1,62,1],[61,2,62,10],[61,11,62,12],[55,0,56,0],[55,1,56,1],[55,2,56,10],[55,11,56,12],[16,14,17,18],[27,14,28,18],[30,22,35,25],[34,14,35,18],[36,14,37,18],[48,1,48,12],[10,22,13,25],[11,14,11,18],[12,5,12,8],[13,1,13,12],[5,22,8,25],[6,0,52,0],[6,3,6,12],[6,14,7,18],[8,1,9,1],[8,2,9,2],[8,9,9,10],[8,11,9,11],[10,1,11,2],[10,6,10,7],[50,1,50,12],[51,1,51,12],[1,0,2,12],[1,14,2,18],[1,20,2,20],[3,14,4,18],[3,20,25,20],[4,0,5,0],[4,1,5,1],[4,2,5,10],[4,11,5,12],[5,14,5,18],[10,10,11,10],[10,11,11,11],[10,14,10,18]]}
[3,5,11,30,12,11,10,5,11,30,12,11,10,null,12,12,19,12,12]
["Recettes de ?",null,null,null,null,null,null,null,null,null,null,null,null,null,"Récap du Mode d'emploi  de la fiche recette",null,null,null,null,null,"ICI"]
[]
[null,null,null,null,null,null,null,null,null,null,null,null,null,null,"Recette au nombre de PORTIONS",null,null,null,null,null,"Sur la tranche des fiches indiquez : DANS QUELLE FAMILLE CETTE RECETTE EST A CLASSER ",{"$f":"U4","v":"Sur la tranche des fiches indiquez : DANS QUELLE FAMILLE CETTE RECETTE EST A CLASSER "}]
["ICI","① ","NOM DU PLAT",null,null,null,null,null,null,null,null,9]
[null,null,null,null,null,null,null,null,null,null,null,null,null,null,"à saisir",null,null,null,null,null,null,null,"J'ai parfois volontairement augmenté le nombre de portions ❽ pour diminuer  le poids pour 1 portion ⑩ qui ne convenait pas à mes convives"]
["Sur la tranche des fiches indiquez : DANS QUELLE FAMILLE CETTE RECETTE EST A CLASSER ",null,"② Auteur >","Robert",null,null,null,null,null,null,null,null,null,null,"① NOM de la recette a saisir et N° ou lettre Alpha"]
[null,null,null,null,null,null,null,null,null,null,null,"⓫"]
[null,10,"❽ Nombre de portions",null,null,null,null,null,null,"A dupliquer pour",null,5,null,null,"② saisissez le nom de Auteur"]
[]
[null,{"$f":"C50+I50","v":0.55000000000000004},null,null,null,"⑩ poids pour 1 portion",{"$f":"B11/B9","v":5.5000000000000007E-2},null,null,null,"⑫ Poids à fabriquer",{"$f":"G11*L9","v":0.27500000000000002},null,null,"Poids à saisir en Kg",null,null,null,null,null,null,null,"le surlignage des lignes et colonnes s'obtient avec une Mise en forme conditionnelle MFC avec cette formule =OU(LIGNE()=CELLULE(\"ligne\");COLONNE()=CELLULE(\"colonne\")) "]
[null,null,null,null,null,null,null,null,null,null,null,null,null,null,"Exep. 3 œufs de 0.050"]
[null,"⑨ Poids total Auteur",null,null,"Recette éditée le",{"$f":"NOW()","v":"2021-12-20T19:39:32.240"},null,null,null,null,"⑬ Contrôle Total saisi",{"$f":"E33+K33","v":0.27500000000000002},null,null,"❹ Unités","❺  Poids","❸ les Ingrédients","⑦ Quantités","❻ Quoi"]
[null,null,null,null,null,null,null,null,null,null,null,null,null,null,3,0.05,"œufs",2.5,"Kg"]
[null,null,"Vous pouvez intervenir sur le poids portion ⑩ en modifiant le nombre de portions ❽",null,null,null,null,null,"⓫ Combien de Portions voulez vous faire",null,null,null,{"$f":"LARGE(B16:B31,1)","v":4},null,null,0.15,"ou œufs liquides",0.72499999999999998,"Kg",null,null,null,"et cette commande de code dans Worksheet"]
[null,0,"④ PHASES ESSENTIELLES  DE PROGRESSION",null,null,null,null,null,null,null,null,null,{"$f":"+IF(ISBLANK(L16),\"\",LARGE(M15:M15,1)+1)","v":""},null,3,null,"œufs",12,"œufs",null,null,null," Private Sub Worksheet_SelectionChange(ByVal Target As Range)  "]
[null,{"$f":"IF(ISBLANK(C17),\"\",LARGE(B16:B16,1)+1)","v":""},null,null,null,null,null,null,null,null,null,null,{"$f":"+IF(ISBLANK(L17),\"\",LARGE(M15:M16,1)+1)","v":""},null,"⑦ Lorsque vous avez des produits à l'unité réduisez les décimales pour une meilleure lecture",null,null,null,null,null,null,null,"  Calculate"]
[null,{"$f":"+IF(ISBLANK(C18),\"\",LARGE(B16:B17,1)+1)","v":1},"soyez concis 1 verbe = 1 action",null,null,null,null,null,null,null,null,null,{"$f":"+IF(ISBLANK(L18),\"\",LARGE(M15:M17,1)+1)","v":""},null,null,null,null,null,null,null,null,null,"End Sub"]
[null,{"$f":"IF(ISBLANK(C19),\"\",LARGE(B16:B18,1)+1)","v":2},"Utilisez le vocabulaire professionnel",null,null,null,null,null,null,null,null,"la numérotation est automatique",{"$f":"+IF(ISBLANK(L19),\"\",LARGE(M15:M18,1)+1)","v":5},null,null,null,null,"⑦ Quantités","❻ Quoi",null,null,null,15,15,15,15,"largeur de colonnes"]
[null,{"$f":"IF(ISBLANK(C20),\"\",LARGE(B16:B19,1)+1)","v":3},"la numérotation est automatique",null,null,null,null,null,null,null,"lorsque vous saisissez du texte",null,{"$f":"+IF(ISBLANK(L20),\"\",LARGE(M15:M19,1)+1)","v":""},null,null,null,"utilisez le pinceau pour ce faire",12,"œufs"]
[null,{"$f":"IF(ISBLANK(C21),\"\",LARGE(B16:B20,1)+1)","v":""},null,"lorsque vous saisissez du texte",null,null,null,null,null,null,null,"dans la colonne C ou dans la colonne L",{"$f":"+IF(ISBLANK(L21),\"\",LARGE(M15:M20,1)+1)","v":6},null,null,null,null,null,null,null,null,null,"Cours VBA : les événements Worksheet"]
[null,{"$f":"IF(ISBLANK(C22),\"\",LARGE(B16:B21,1)+1)","v":4},"dans la colonne C ou dans la colonne L",null,null,null,null,null,null,null,null,null,{"$f":"+IF(ISBLANK(L22),\"\",LARGE(M15:M21,1)+1)","v":""},null,"❽  Nombre de portions prévues par l'Auteur",null,null,null,null,null,null,null,"Lien>","https://www.exceltip.com/events-in-vba/the-worksheet-events-in-excel-vba.html"]
[null,{"$f":"IF(ISBLANK(C23),\"\",LARGE(B16:B22,1)+1)","v":""},null,"si vous ne voulez pas de numérotation",null,null,null,null,null,null,null,"si vous ne voulez pas de numérotation",{"$f":"+IF(ISBLANK(L23),\"\",LARGE(M15:M22,1)+1)","v":7},null,"Poids total Auteur ⑨ somme des colonnes ❺  Poids",null,null,null,null,null,null,null,"Lien>","https://www.excel-pratique.com/fr/vba/evenements_feuille"]
[null,{"$f":"IF(ISBLANK(C24),\"\",LARGE(B16:B23,1)+1)","v":""},null,"saisissez votre texte dans la colonne D ou K",null,null,null,null,null,null,"saisissez votre texte dans la colonne K",null,{"$f":"+IF(ISBLANK(L24),\"\",LARGE(M15:M23,1)+1)","v":""},null,"formule utilisée","SI(ESTVIDE(B34);C34;B34*C34)+SI(ESTVIDE(B35);C35;B35*C35) etc.."]
[null,{"$f":"IF(ISBLANK(C25),\"\",LARGE(B16:B24,1)+1)","v":""},null,null,null,null,null,null,null,null,null,null,{"$f":"+IF(ISBLANK(L25),\"\",LARGE(M15:M24,1)+1)","v":""},null,"cette formule multiplie les  Unités ❹  mais n'additionne que les Poids ❺",null,null,null,null,null,null,null,"lien >","Les unités pifométriques"]
[null,{"$f":"IF(ISBLANK(C26),\"\",LARGE(B16:B25,1)+1)","v":""},null,null,null,null,null,null,null,null,null,null,{"$f":"+IF(ISBLANK(L26),\"\",LARGE(M15:M25,1)+1)","v":""}]
[null,{"$f":"+IF(ISBLANK(C27),\"\",LARGE(B16:B26,1)+1)","v":""},null,null,null,null,null,null,null,null,null,null,{"$f":"+IF(ISBLANK(L27),\"\",LARGE(M15:M26,1)+1)","v":""},null,"⑩ poids pour 1 portion",null,null,null,null,null,null,null,"Impression Portrait 1 recette par feuille A4"]
[null,{"$f":"IF(ISBLANK(C28),\"\",LARGE(B16:B27,1)+1)","v":""},null,null,null,null,null,null,null,null,null,null,{"$f":"+IF(ISBLANK(L28),\"\",LARGE(M15:M27,1)+1)","v":""},null,"Vous pouvez intervenir sur le poids portion ⑩ en augmentant ou en diminuant le nombre de portions ❽"]
[null,{"$f":"IF(ISBLANK(C29),\"\",LARGE(B16:B28,1)+1)","v":""},null,null,null,null,null,null,null,null,null,null,{"$f":"+IF(ISBLANK(L29),\"\",LARGE(M15:M28,1)+1)","v":""},null,null,null,null,null,null,null,null,null,{"$f":"\"Page \"&_xlfn.SHEET()&\" sur \"&_xlfn.SHEETS()","v":"Page 7 sur 16"}]
[null,{"$f":"IF(ISBLANK(C30),\"\",LARGE(B16:B29,1)+1)","v":""},null,null,null,null,null,null,null,null,null,null,{"$f":"+IF(ISBLANK(L30),\"\",LARGE(M15:M29,1)+1)","v":""}]
[null,{"$f":"IF(ISBLANK(C31),\"\",LARGE(B16:B30,1)+1)","v":""},null,null,null,null,null,null,null,null,null,null,{"$f":"+IF(ISBLANK(L31),\"\",LARGE(M15:M30,1)+1)","v":""},null,"⓫ Combien de Portions voulez vous faire",null,null,null,null,null,null,null,"Avant de saisir quoi que ce soit dans une cellule - cliquez dessus pour vérifier qu'il n'y ait pas de formule"]
[null,"❹ Unités","❺  Poids","❸ Ingrédients","⑦ Quantités","%","❻ Quoi","❹ Unités","❺  Poids","❸ Ingrédients","⑦ Quantités","%","❻ Quoi",null,null,"⑫ Poids à fabriquer = ⑩ X ⓫"]
[null,null,null,"S.Total saisi >",{"$f":"IF(ISNUMBER(C34),E34)+IF(ISNUMBER(C35),E35)+IF(ISNUMBER(C36),E36)+IF(ISNUMBER(C37),E37)+IF(ISNUMBER(C38),E38)+IF(ISNUMBER(C39),E39)+IF(ISNUMBER(C40),E40)+IF(ISNUMBER(C41),E41)+IF(ISNUMBER(C42),E42)+IF(ISNUMBER(C43),E43)+IF(ISNUMBER(C44),E44)+IF(ISNUMBER(C45),E45)+IF(ISNUMBER(C46),E46)+IF(ISNUMBER(C47),E47)+IF(ISNUMBER(C48),E48)","v":0.27500000000000002},null,null,null,null,"S.Total saisi >",{"$f":"IF(ISNUMBER(I34),K34)+IF(ISNUMBER(I35),K35)+IF(ISNUMBER(I36),K36)+IF(ISNUMBER(I37),K37)+IF(ISNUMBER(I38),K38)+IF(ISNUMBER(I39),K39)+IF(ISNUMBER(I40),K40)+IF(ISNUMBER(I41),K41)+IF(ISNUMBER(I42),K42)+IF(ISNUMBER(I43),K43)+IF(ISNUMBER(I44),K44)+IF(ISNUMBER(I45),K45)+IF(ISNUMBER(I46),K46)+IF(ISNUMBER(I47),K47)+IF(ISNUMBER(I48),K48)","v":0},null,null,null,null,"⑬ Contrôle Total saisi somme des colonnes ⑦ Quantités"]
[null,8,0.05,"œufs",{"$f":"IF(ISBLANK(B34),C34/B11*L11,IF(ISBLANK(C34),B34/B11*L11,(B34*C34)/B11*L11))","v":0.2},{"$f":"IF(ISNUMBER(C34),E34/L13,\"\")","v":0.72727272727272729},"Kg",null,null,"Chair à saucisse",{"$f":"IF(ISBLANK(H34),I34/B11*L11,IF(ISBLANK(I34),H34/B11*L11,(H34*I34)/B11*L11))","v":0},{"$f":"IF(ISNUMBER(I34),K34/L13,\"\")","v":""},"Kg",null,"formule utilisée","SI(ESTNUM(C34);E34)+SI(ESTNUM(C35);E35) etc.."]
[null,null,0.15,"ou œufs liquides",{"$f":"IF(ISBLANK(B35),C35/B11*L11,IF(ISBLANK(C35),B35/B11*L11,(B35*C35)/B11*L11))","v":7.4999999999999997E-2},{"$f":"IF(ISNUMBER(C35),E35/L13,\"\")","v":0.27272727272727271},"Kg",null,null,null,{"$f":"IF(ISBLANK(H35),I35/B11*L11,IF(ISBLANK(I35),H35/B11*L11,(H35*I35)/B11*L11))","v":0},{"$f":"IF(ISNUMBER(I35),K35/L13,\"\")","v":""},"Kg",null,"cette formule n'additionne que les quantités ⑦ à condition qu'il y ait eu un nombre saisi en  Poids ❺ "]
[null,3,null,"œufs",{"$f":"IF(ISBLANK(B36),C36/B11*L11,IF(ISBLANK(C36),B36/B11*L11,(B36*C36)/B11*L11))","v":1.5},{"$f":"IF(ISNUMBER(C36),E36/L13,\"\")","v":""},"œufs",null,null,null,{"$f":"IF(ISBLANK(H36),I36/B11*L11,IF(ISBLANK(I36),H36/B11*L11,(H36*I36)/B11*L11))","v":0},{"$f":"IF(ISNUMBER(I36),K36/L13,\"\")","v":""},"Kg"]
[null,null,null,null,{"$f":"IF(ISBLANK(B37),C37/B11*L11,IF(ISBLANK(C37),B37/B11*L11,(B37*C37)/B11*L11))","v":0},{"$f":"IF(ISNUMBER(C37),E37/L13,\"\")","v":""},"Kg",null,null,null,{"$f":"IF(ISBLANK(H37),I37/B11*L11,IF(ISBLANK(I37),H37/B11*L11,(H37*I37)/B11*L11))","v":0},{"$f":"IF(ISNUMBER(I37),K37/L13,\"\")","v":""},"Kg",null,"autrement dit elle ne mélange pas ❹ Unités et ❺  Poids sinon allez expliquer à Excel qu'1 œuf ne fait pas 1 Kg"]
[null,null,null,null,{"$f":"IF(ISBLANK(B38),C38/B11*L11,IF(ISBLANK(C38),B38/B11*L11,(B38*C38)/B11*L11))","v":0},{"$f":"IF(ISNUMBER(C38),E38/L13,\"\")","v":""},"Kg",null,null,null,{"$f":"IF(ISBLANK(H38),I38/B11*L11,IF(ISBLANK(I38),H38/B11*L11,(H38*I38)/B11*L11))","v":0},{"$f":"IF(ISNUMBER(I38),K38/L13,\"\")","v":""},"Kg"]
[null,null,null,null,{"$f":"IF(ISBLANK(B39),C39/B11*L11,IF(ISBLANK(C39),B39/B11*L11,(B39*C39)/B11*L11))","v":0},{"$f":"IF(ISNUMBER(C39),E39/L13,\"\")","v":""},"Kg",null,null,null,{"$f":"IF(ISBLANK(H39),I39/B11*L11,IF(ISBLANK(I39),H39/B11*L11,(H39*I39)/B11*L11))","v":0},{"$f":"IF(ISNUMBER(I39),K39/L13,\"\")","v":""},"Kg"]
[null,null,null,null,{"$f":"IF(ISBLANK(B40),C40/B11*L11,IF(ISBLANK(C40),B40/B11*L11,(B40*C40)/B11*L11))","v":0},{"$f":"IF(ISNUMBER(C40),E40/L13,\"\")","v":""},"Kg",null,null,null,{"$f":"IF(ISBLANK(H40),I40/B11*L11,IF(ISBLANK(I40),H40/B11*L11,(H40*I40)/B11*L11))","v":0},{"$f":"IF(ISNUMBER(I40),K40/L13,\"\")","v":""},"Kg",null,"④ PHASES ESSENTIELLES  DE PROGRESSION"]
[null,null,null,null,{"$f":"IF(ISBLANK(B41),C41/B11*L11,IF(ISBLANK(C41),B41/B11*L11,(B41*C41)/B11*L11))","v":0},{"$f":"IF(ISNUMBER(C41),E41/L13,\"\")","v":""},"Kg",null,null,null,{"$f":"IF(ISBLANK(H41),I41/B11*L11,IF(ISBLANK(I41),H41/B11*L11,(H41*I41)/B11*L11))","v":0},{"$f":"IF(ISNUMBER(I41),K41/L13,\"\")","v":""},"Kg",null,"soyez concis 1 verbe = 1 action"]
[null,null,null,null,{"$f":"IF(ISBLANK(B42),C42/B11*L11,IF(ISBLANK(C42),B42/B11*L11,(B42*C42)/B11*L11))","v":0},{"$f":"IF(ISNUMBER(C42),E42/L13,\"\")","v":""},"Kg",null,null,null,{"$f":"IF(ISBLANK(H42),I42/B11*L11,IF(ISBLANK(I42),H42/B11*L11,(H42*I42)/B11*L11))","v":0},{"$f":"IF(ISNUMBER(I42),K42/L13,\"\")","v":""},"Kg",null,"Utilisez le vocabulaire professionnel"]
[null,null,null,null,{"$f":"IF(ISBLANK(B43),C43/B11*L11,IF(ISBLANK(C43),B43/B11*L11,(B43*C43)/B11*L11))","v":0},{"$f":"IF(ISNUMBER(C43),E43/L13,\"\")","v":""},"Kg",null,null,null,{"$f":"IF(ISBLANK(H43),I43/B11*L11,IF(ISBLANK(I43),H43/B11*L11,(H43*I43)/B11*L11))","v":0},{"$f":"IF(ISNUMBER(I43),K43/L13,\"\")","v":""},"Kg",null,"la numérotation est automatique"]
[null,null,null,null,{"$f":"IF(ISBLANK(B44),C44/B11*L11,IF(ISBLANK(C44),B44/B11*L11,(B44*C44)/B11*L11))","v":0},{"$f":"IF(ISNUMBER(C44),E44/L13,\"\")","v":""},"Kg",null,null,null,{"$f":"IF(ISBLANK(H44),I44/B11*L11,IF(ISBLANK(I44),H44/B11*L11,(H44*I44)/B11*L11))","v":0},{"$f":"IF(ISNUMBER(I44),K44/L13,\"\")","v":""},"Kg",null,null,"lorsque vous saisissez du texte"]
[null,null,null,null,{"$f":"IF(ISBLANK(B45),C45/B11*L11,IF(ISBLANK(C45),B45/B11*L11,(B45*C45)/B11*L11))","v":0},{"$f":"IF(ISNUMBER(C45),E45/L13,\"\")","v":""},"Kg",null,null,null,{"$f":"IF(ISBLANK(H45),I45/B11*L11,IF(ISBLANK(I45),H45/B11*L11,(H45*I45)/B11*L11))","v":0},{"$f":"IF(ISNUMBER(I45),K45/L13,\"\")","v":""},"Kg",null,"dans la colonne C ou dans la colonne L"]
[null,null,null,null,{"$f":"IF(ISBLANK(B46),C46/B11*L11,IF(ISBLANK(C46),B46/B11*L11,(B46*C46)/B11*L11))","v":0},{"$f":"IF(ISNUMBER(C46),E46/L13,\"\")","v":""},"Kg",null,null,null,{"$f":"IF(ISBLANK(H46),I46/B11*L11,IF(ISBLANK(I46),H46/B11*L11,(H46*I46)/B11*L11))","v":0},{"$f":"IF(ISNUMBER(I46),K46/L13,\"\")","v":""},"Kg",null,null,"si vous ne voulez pas de numérotation"]
[null,null,null,null,{"$f":"IF(ISBLANK(B47),C47/B11*L11,IF(ISBLANK(C47),B47/B11*L11,(B47*C47)/B11*L11))","v":0},{"$f":"IF(ISNUMBER(C47),E47/L13,\"\")","v":""},"Kg",null,null,null,{"$f":"IF(ISBLANK(H47),I47/B11*L11,IF(ISBLANK(I47),H47/B11*L11,(H47*I47)/B11*L11))","v":0},{"$f":"IF(ISNUMBER(I47),K47/L13,\"\")","v":""},"Kg",null,null,"saisissez votre texte dans la colonne D ou K"]
[null,null,null,null,{"$f":"IF(ISBLANK(B48),C48/B11*L11,IF(ISBLANK(C48),B48/B11*L11,(B48*C48)/B11*L11))","v":0},{"$f":"IF(ISNUMBER(C48),E48/L13,\"\")","v":""},"Kg",null,null,null,{"$f":"IF(ISBLANK(H48),I48/B11*L11,IF(ISBLANK(I48),H48/B11*L11,(H48*I48)/B11*L11))","v":0},{"$f":"IF(ISNUMBER(I48),K48/L13,\"\")","v":""},"Kg",null,"formule utilisée :"]
[null,null,null,null,null,null,null,null,null,null,null,null,null,null,"colonne B"]
[null,null,{"$f":"IF(ISBLANK(B34),C34,B34*C34)+IF(ISBLANK(B35),C35,B35*C35)+IF(ISBLANK(B36),C36,B36*C36)+IF(ISBLANK(B37),C37,B37*C37)+IF(ISBLANK(B38),C38,B38*C38)+IF(ISBLANK(B39),C39,B39*C39)+IF(ISBLANK(B40),C40,B40*C40)+IF(ISBLANK(B41),C41,B41*C41)+IF(ISBLANK(B42),C42,B42*C42)+IF(ISBLANK(B43),C43,B43*C43)+IF(ISBLANK(B44),C44,B44*C44)+IF(ISBLANK(B45),C45,B45*C45)+IF(ISBLANK(B46),C46,B46*C46)+IF(ISBLANK(B47),C47,B47*C47)+IF(ISBLANK(B48),C48,B48*C48)","v":0.55000000000000004},"< S.total Auteur  - S.total saisi >",{"$f":"IF(ISNUMBER(C34),E34)+IF(ISNUMBER(C35),E35)+IF(ISNUMBER(C36),E36)+IF(ISNUMBER(C37),E37)+IF(ISNUMBER(C38),E38)+IF(ISNUMBER(C39),E39)+IF(ISNUMBER(C40),E40)+IF(ISNUMBER(C41),E41)+IF(ISNUMBER(C42),E42)+IF(ISNUMBER(C43),E43)+IF(ISNUMBER(C44),E44)+IF(ISNUMBER(C45),E45)+IF(ISNUMBER(C46),E46)+IF(ISNUMBER(C47),E47)+IF(ISNUMBER(C48),E48)","v":0.27500000000000002},null,null,"S.total Auteur >",{"$f":"IF(ISBLANK(H34),I34,H34*I34)+IF(ISBLANK(H35),I35,H35*I35)+IF(ISBLANK(H36),I36,H36*I36)+IF(ISBLANK(H37),I37,H37*I37)+IF(ISBLANK(H38),I38,H38*I38)+IF(ISBLANK(H39),I39,H39*I39)+IF(ISBLANK(H40),I40,H40*I40)+IF(ISBLANK(H41),I41,H41*I41)+IF(ISBLANK(H42),I42,H42*I42)+IF(ISBLANK(H43),I43,H43*I43)+IF(ISBLANK(H44),I44,H44*I44)+IF(ISBLANK(H45),I45,H45*I45)+IF(ISBLANK(H46),I46,H46*I46)+IF(ISBLANK(H47),I47,H47*I47)+IF(ISBLANK(H48),I48,H48*I48)+IF(ISBLANK(H49),I49,H49*I49)","v":0},null,"Total Auteur >",{"$f":"I50+C50","v":0.55000000000000004},null,null,"SI(ESTVIDE(C27);\"\";GRANDE.VALEUR(B16:B26;1)+1)",null,null,null,"Colonne M"]
[null,{"$f":"CELL(\"nomfichier\")","v":"E:\\0-UPRT\\1-UPRT.FR-SITE-WEB\\re-recettes-jean-marc-catteau\\re-catteau-galettes\\[GA-pate.sud.finistere.xlsm]Modes.d'emploi"},null,null,null,null,null,null,null,null,null,null,null,null,null,null,null,null,"SI(ESTVIDE(L27);\"\";GRANDE.VALEUR(M15:M26;1)+1)"]
[null,"Adaptation : Joël Leboucher..UPRT \"Union des Personnels de la Restauration Territoriale\"  membre du réseau RESTAU'CO",null,null,null,null,null,null,null,null,null,null,null,null,12,12,19,12,12,"< Largeurs de colonnes"]
[null,5,11,30,12,11,10,5,11,30,12,11,10,"< Largeurs de colonnes"]
[]
[]
[null,"① ","Servez vous du pinceau Mise en forme pour changer les couleurs d'entête des recettes ou collez celles-ci à la place",null,null,null,null,null,null,null,null,"Codes ou N°"]
[]
[]
["ICI","① ","DIVERS",null,null,null,null,null,null,null,null,"DIV001"]
[]
[]
["ICI","① ","brun PATISSERIE",null,null,null,null,null,null,null,null,"PAT001"]
[]
[]
["ICI","① ","bleu vert DESSERTS",null,null,null,null,null,null,null,null,"DES001"]
[]
[]
["ICI","① ","bleu LAITAGES FROMAGES",null,null,null,null,null,null,null,null,"LAI001"]
[]
[]
["ICI","① ","bleu moyen LAITAGES + FÉCULENTS",null,null,null,null,null,null,null,null,"LFC001"]
[]
[]
["ICI","① ","vert brillant ACCOMPAGNEMENT COMPOSÉS VERTS",null,null,null,null,null,null,null,null,"ACC001"]
[]
[]
["ICI","① ","orange PLATS COMPLETS",null,null,null,null,null,null,null,null,"PLC001"]
[]
[]
["ICI","① ","bleu ciel  POISSON",null,null,null,null,null,null,null,null,"POI001"]
[]
[]
["ICI","① ","or VOLAILLES",null,null,null,null,null,null,null,null,"VOL001"]
[null,null,null,null,null,null,null,null,null,null,null,null,null,null,null,null,null,null,null,null,null,null,null,null,null,null,0]
[null,null,null,null,null,null,null,null,null,null,null,null,null,null,null,null,null,null,null,null,null,null,null,null,null,null,0]
["ICI","① ","rouge VIANDE",null,null,null,null,null,null,null,null,"VIA001",null,null,null,null,null,null,null,null,null,null,null,null,null,null,0]
[null,null,null,null,null,null,null,null,null,null,null,null,null,null,null,null,null,null,null,null,null,null,null,null,null,null,0]
[null,null,null,null,null,null,null,null,null,null,null,null,null,null,null,null,null,null,null,null,null,null,null,null,null,null,0]
["ICI","① ","rose PLAT PRINCIPAL",null,null,null,null,null,null,null,null,"PLA001",null,null,null,null,null,null,null,null,null,null,null,null,null,null,0]
[null,null,null,null,null,null,null,null,null,null,null,null,null,null,null,null,null,null,null,null,null,null,null,null,null,null,0]
[null,null,null,null,null,null,null,null,null,null,null,null,null,null,null,null,null,null,null,null,null,null,null,null,null,null,0]
["ICI","① ","marron FÉCULENTS",null,null,null,null,null,null,null,null,"FEC001",null,null,null,null,null,null,null,null,null,null,null,null,null,null,0]
[null,null,null,null,null,null,null,null,null,null,null,null,null,null,null,null,null,null,null,null,null,null,null,null,null,null,0]
[null,null,null,null,null,null,null,null,null,null,null,null,null,null,null,null,null,null,null,null,null,null,null,null,null,null,0]
["ICI","① ","citron vert CUIDITÉS",null,null,null,null,null,null,null,null,"CUI001",null,null,null,null,null,null,null,null,null,null,null,null,null,null,0]
[null,null,null,null,null,null,null,null,null,null,null,null,null,null,null,null,null,null,null,null,null,null,null,null,null,null,0]
[null,null,null,null,null,null,null,null,null,null,null,null,null,null,null,null,null,null,null,null,null,null,null,null,null,null,0]
["ICI","① ","vert CRUDITÉS",null,null,null,null,null,null,null,null,"CRU001",null,null,null,null,null,null,null,null,null,null,null,null,null,null,0]
[null,null,null,null,null,null,null,null,null,null,null,null,null,null,null,null,null,null,null,null,null,null,null,null,null,null,0]
[null,null,null,null,null,null,null,null,null,null,null,null,null,null,null,null,null,null,null,null,null,null,null,null,null,null,0]
["ICI","① ","violet  ENTRÉES CHAUDES",null,null,null,null,null,null,null,null,"ENT001",null,null,null,null,null,null,null,null,null,null,null,null,null,null,0]
[null,null,null,null,null,null,null,null,null,null,null,null,null,null,null,null,null,null,null,null,null,null,null,null,null,null,0]
[null,null,null,null,null,null,null,null,null,null,null,null,null,null,null,null,null,null,null,null,null,null,null,null,null,null,0]
["ICI","① ","vert marin  ENTRÉES FROIDES",null,null,null,null,null,null,null,null,"ENT001",null,null,null,null,null,null,null,null,null,null,null,null,null,null,0]
[null,null,null,null,null,null,null,null,null,null,null,null,null,null,null,null,null,null,null,null,null,null,null,null,null,null,0]
[null,null,null,null,null,null,null,null,null,null,null,null,null,null,null,null,null,null,null,null,null,null,null,null,null,null,0]
[null,null,null,null,null,null,null,null,null,null,null,null,null,null,null,null,null,null,null,null,null,null,null,null,null,null,"FIN"]
[null,null,null,null,null,null,null,null,null,null,null,null,null,null,null,null,null,null,null,null,null,null,null,null,null,null,{"$f":"ADDRESS(ROW(),COLUMN(),4)","v":"AA108"}]

{"sheet":"Modèle.Portrait.2.deux.FICHES","index":7,"n_rows":108,"n_cols":41,"rows_kept":108,"cut":false,"hidden":false,"merged":[[100,14,101,14],[100,15,101,15],[100,16,101,24],[100,25,101,26],[103,14,104,14],[103,15,104,15],[103,16,104,24],[103,25,104,26],[94,14,95,14],[94,15,95,15],[94,16,95,24],[94,25,95,26],[97,14,98,14],[97,15,98,15],[97,16,98,24],[97,25,98,26],[88,14,89,14],[88,15,89,15],[88,16,89,24],[88,25,89,26],[91,14,92,14],[91,15,92,15],[91,16,92,24],[91,25,92,26],[82,14,83,14],[82,15,83,15],[82,16,83,24],[82,25,83,26],[85,14,86,14],[85,15,86,15],[85,16,86,24],[85,25,86,26],[76,14,77,14],[76,15,77,15],[76,16,77,24],[76,25,77,26],[79,14,80,14],[79,15,80,15],[79,16,80,24],[79,25,80,26],[70,14,71,14],[70,15,71,15],[70,16,71,24],[70,25,71,26],[73,14,74,14],[73,15,74,15],[73,16,74,24],[73,25,74,26],[67,14,68,14],[67,15,68,15],[67,16,68,24],[67,25,68,26],[58,14,59,14],[58,15,59,15],[58,16,59,24],[58,25,59,26],[61,14,62,14],[61,15,62,15],[61,16,62,24],[61,25,62,26],[55,25,56,26],[8,25,9,25],[10,15,11,16],[10,20,10,21],[10,24,11,24],[10,25,11,25],[12,19,12,22],[64,14,65,14],[64,15,65,15],[64,16,65,24],[64,25,65,26],[100,0,101,0],[100,1,101,1],[100,2,101,10],[100,11,101,12],[103,0,104,0],[103,1,104,1],[103,2,104,10],[103,11,104,12],[94,0,95,0],[94,1,95,1],[94,2,95,10],[94,11,95,12],[97,0,98,0],[97,1,98,1],[97,2,98,10],[97,11,98,12],[88,0,89,0],[88,1,89,1],[88,2,89,10],[88,11,89,12],[91,0,92,0],[91,1,92,1],[91,2,92,10],[91,11,92,12],[82,0,83,0],[82,1,83,1],[82,2,83,10],[82,11,83,12],[85,0,86,0],[85,1,86,1],[85,2,86,10],[85,11,86,12],[76,0,77,0],[76,1,77,1],[76,2,77,10],[76,11,77,12],[79,0,80,0],[79,1,80,1],[79,2,80,10],[79,11,80,12],[70,0,71,0],[70,1,71,1],[70,2,71,10],[70,11,71,12],[73,0,74,0],[73,1,74,1],[73,2,74,10],[73,11,74,12],[64,0,65,0],[64,1,65,1],[64,2,65,10],[64,11,65,12],[67,0,68,0],[67,1,68,1],[67,2,68,10],[67,11,68,12],[58,0,59,0],[58,1,59,1],[58,2,59,10],[58,11,59,12],[61,0,62,0],[61,1,62,1],[61,2,62,10],[61,11,62,12],[50,1,50,12],[51,1,51,12],[55,0,56,0],[55,1,56,1],[55,2,56,10],[55,11,56,12],[16,28,17,32],[27,28,28,32],[30,36,35,39],[34,28,35,32],[36,28,37,32],[48,1,48,12],[48,15,48,26],[6,0,52,0],[6,14,52,14],[6,17,6,26],[8,15,9,15],[8,16,9,16],[8,23,9,24],[50,15,50,26],[51,15,51,26],[55,14,56,14],[55,15,56,15],[55,16,56,24],[10,36,13,39],[11,28,11,32],[12,5,12,8],[13,1,13,12],[13,15,13,26],[5,36,8,39],[6,3,6,12],[6,28,7,32],[8,1,9,1],[8,2,9,2],[8,9,9,10],[8,11,9,11],[10,1,11,2],[10,6,10,7],[4,14,5,14],[4,15,5,15],[4,16,5,24],[4,25,5,26],[1,0,2,12],[1,28,2,32],[1,34,2,34],[3,28,4,32],[3,34,25,34],[4,0,5,0],[4,1,5,1],[4,2,5,10],[4,11,5,12],[5,28,5,32],[10,10,11,10],[10,11,11,11],[10,28,10,32],[1,14,2,26]]}
[3,5,11,30,12,11,10,5,11,30,12,11,10,null,3,5,11,30,12,11,10,5,11,30,12,11,10,null,12,12,19,12,12]
["Recettes de ?",null,null,null,null,null,null,null,null,null,null,null,null,null,"Recettes de ?",null,null,null,null,null,null,null,null,null,null,null,null,null,"Récap du Mode d'emploi  de la fiche recette",null,null,null,null,null,"ICI"]
[]
[null,null,null,null,null,null,null,null,null,null,null,null,null,null,null,null,null,null,null,null,null,null,null,null,null,null,null,null,"Recette au nombre de PORTIONS",null,null,null,null,null,"Sur la tranche des fiches indiquez : DANS QUELLE FAMILLE CETTE RECETTE EST A CLASSER ",{"$f":"AI4","v":"Sur la tranche des fiches indiquez : DANS QUELLE FAMILLE CETTE RECETTE EST A CLASSER "}]
["ICI","① ","NOM DU PLAT",null,null,null,null,null,null,null,null,9,null,null,"ICI","① ","NOM DU PLAT",null,null,null,null,null,null,null,null,9]
[null,null,null,null,null,null,null,null,null,null,null,null,null,null,null,null,null,null,null,null,null,null,null,null,null,null,null,null,"à saisir",null,null,null,null,null,null,null,"J'ai parfois volontairement augmenté le nombre de portions ❽ pour diminuer  le poids pour 1 portion ⑩ qui ne convenait pas à mes convives"]
["Sur la tranche des fiches indiquez : DANS QUELLE FAMILLE CETTE RECETTE EST A CLASSER ",null,"② Auteur >","Robert",null,null,null,null,null,null,null,null,null,null,"Sur la tranche des fiches indiquez : DANS QUELLE FAMILLE CETTE RECETTE EST A CLASSER ",null,"② Auteur >","Robert",null,null,null,null,null,null,null,null,null,null,"① NOM de la recette a saisir et N° ou lettre Alpha"]
[null,null,null,null,null,null,null,null,null,null,null,"⓫",null,null,null,null,null,null,null,null,null,null,null,null,null,"⓫"]
[null,10,"❽ Nombre de portions",null,null,null,null,null,null,"A dupliquer pour",null,5,null,null,null,10,"❽ Nombre de portions",null,null,null,null,null,null,"A dupliquer pour",null,5,null,null,"② saisissez le nom de Auteur"]
[]
[null,{"$f":"C50+I50","v":0.55000000000000004},null,null,null,"⑩ poids pour 1 portion",{"$f":"B11/B9","v":5.5000000000000007E-2},null,null,null,"⑫ Poids à fabriquer",{"$f":"G11*L9","v":0.27500000000000002},null,null,null,{"$f":"Q50+W50","v":0.55000000000000004},null,null,null,"⑩ poids pour 1 portion",{"$f":"P11/P9","v":5.5000000000000007E-2},null,null,null,"⑫ Poids à fabriquer",{"$f":"U11*Z9","v":0.27500000000000002},null,null,"Poids à saisir en Kg",null,null,null,null,null,null,null,"le surlignage des lignes et colonnes s'obtient avec une Mise en forme conditionnelle MFC avec cette formule =OU(LIGNE()=CELLULE(\"ligne\");COLONNE()=CELLULE(\"colonne\")) "]
[null,null,null,null,null,null,null,null,null,null,null,null,null,null,null,null,null,null,null,null,null,null,null,null,null,null,null,null,"Exep. 3 œufs de 0.050"]
[null,"⑨ Poids total Auteur",null,null,"Recette éditée le",{"$f":"NOW()","v":"2021-12-20T19:39:32.240"},null,null,null,null,"⑬ Contrôle Total saisi",{"$f":"E33+K33","v":0.27500000000000002},null,null,null,"⑨ Poids total Auteur",null,null,"Recette éditée le",{"$f":"NOW()","v":"2021-12-20T19:39:32.240"},null,null,null,null,"⑬ Contrôle Total saisi",{"$f":"S33+Y33","v":0.27500000000000002},null,null,"❹ Unités","❺  Poids","❸ les Ingrédients","⑦ Quantités","❻ Quoi"]
[null,null,null,null,null,null,null,null,null,null,null,null,null,null,null,null,null,null,null,null,null,null,null,null,null,null,null,null,3,0.05,"œufs",2.5,"Kg"]
[null,null,"Vous pouvez intervenir sur le poids portion ⑩ en modifiant le nombre de portions ❽",null,null,null,null,null,"⓫ Combien de Portions voulez vous faire",null,null,null,{"$f":"LARGE(B16:B31,1)","v":4},null,null,null,"Vous pouvez intervenir sur le poids portion ⑩ en modifiant le nombre de portions ❽",null,null,null,null,null,"⓫ Combien de Portions voulez vous faire",null,null,null,{"$f":"LARGE(P16:P31,1)","v":4},null,null,0.15,"ou œufs liquides",0.72499999999999998,"Kg",null,null,null,"et cette commande de code dans Worksheet"]
[null,0,"④ PHASES ESSENTIELLES  DE PROGRESSION",null,null,null,null,null,null,null,null,null,{"$f":"+IF(ISBLANK(L16),\"\",LARGE(M15:M15,1)+1)","v":""},null,null,0,"④ PHASES ESSENTIELLES  DE PROGRESSION",null,null,null,null,null,null,null,null,null,{"$f":"+IF(ISBLANK(Z16),\"\",LARGE(AA15:AA15,1)+1)","v":""},null,3,null,"œufs",12,"œufs",null,null,null," Private Sub Worksheet_SelectionChange(ByVal Target As Range)  "]
[null,{"$f":"IF(ISBLANK(C17),\"\",LARGE(B16:B16,1)+1)","v":""},null,null,null,null,null,null,null,null,null,null,{"$f":"+IF(ISBLANK(L17),\"\",LARGE(M15:M16,1)+1)","v":""},null,null,{"$f":"IF(ISBLANK(Q17),\"\",LARGE(P16:P16,1)+1)","v":""},null,null,null,null,null,null,null,null,null,null,{"$f":"+IF(ISBLANK(Z17),\"\",LARGE(AA15:AA16,1)+1)","v":""},null,"⑦ Lorsque vous avez des produits à l'unité réduisez les décimales pour une meilleure lecture",null,null,null,null,null,null,null,"  Calculate"]
[null,{"$f":"+IF(ISBLANK(C18),\"\",LARGE(B16:B17,1)+1)","v":1},"soyez concis 1 verbe = 1 action",null,null,null,null,null,null,null,null,null,{"$f":"+IF(ISBLANK(L18),\"\",LARGE(M15:M17,1)+1)","v":""},null,null,{"$f":"+IF(ISBLANK(Q18),\"\",LARGE(P16:P17,1)+1)","v":1},"soyez concis 1 verbe = 1 action",null,null,null,null,null,null,null,null,null,{"$f":"+IF(ISBLANK(Z18),\"\",LARGE(AA15:AA17,1)+1)","v":""},null,null,null,null,null,null,null,null,null,"End Sub"]
[null,{"$f":"IF(ISBLANK(C19),\"\",LARGE(B16:B18,1)+1)","v":2},"Utilisez le vocabulaire professionnel",null,null,null,null,null,null,null,null,"la numérotation est automatique",{"$f":"+IF(ISBLANK(L19),\"\",LARGE(M15:M18,1)+1)","v":5},null,null,{"$f":"IF(ISBLANK(Q19),\"\",LARGE(P16:P18,1)+1)","v":2},"Utilisez le vocabulaire professionnel",null,null,null,null,null,null,null,null,"la numérotation est automatique",{"$f":"+IF(ISBLANK(Z19),\"\",LARGE(AA15:AA18,1)+1)","v":5},null,null,null,null,"⑦ Quantités","❻ Quoi",null,null,null,15,15,15,15,"largeur de colonnes"]
[null,{"$f":"IF(ISBLANK(C20),\"\",LARGE(B16:B19,1)+1)","v":3},"la numérotation est automatique",null,null,null,null,null,null,null,"lorsque vous saisissez du texte",null,{"$f":"+IF(ISBLANK(L20),\"\",LARGE(M15:M19,1)+1)","v":""},null,null,{"$f":"IF(ISBLANK(Q20),\"\",LARGE(P16:P19,1)+1)","v":3},"la numérotation est automatique",null,null,null,null,null,null,null,"lorsque vous saisissez du texte",null,{"$f":"+IF(ISBLANK(Z20),\"\",LARGE(AA15:AA19,1)+1)","v":""},null,null,null,"utilisez le pinceau pour ce faire",12,"œufs"]
[null,{"$f":"IF(ISBLANK(C21),\"\",LARGE(B16:B20,1)+1)","v":""},null,"lorsque vous saisissez du texte",null,null,null,null,null,null,null,"dans la colonne C ou dans la colonne L",{"$f":"+IF(ISBLANK(L21),\"\",LARGE(M15:M20,1)+1)","v":6},null,null,{"$f":"IF(ISBLANK(Q21),\"\",LARGE(P16:P20,1)+1)","v":""},null,"lorsque vous saisissez du texte",null,null,null,null,null,null,null,"dans la colonne C ou dans la colonne L",{"$f":"+IF(ISBLANK(Z21),\"\",LARGE(AA15:AA20,1)+1)","v":6},null,null,null,null,null,null,null,null,null,"Cours VBA : les événements Worksheet"]
[null,{"$f":"IF(ISBLANK(C22),\"\",LARGE(B16:B21,1)+1)","v":4},"dans la colonne C ou dans la colonne L",null,null,null,null,null,null,null,null,null,{"$f":"+IF(ISBLANK(L22),\"\",LARGE(M15:M21,1)+1)","v":""},null,null,{"$f":"IF(ISBLANK(Q22),\"\",LARGE(P16:P21,1)+1)","v":4},"dans la colonne C ou dans la colonne L",null,null,null,null,null,null,null,null,null,{"$f":"+IF(ISBLANK(Z22),\"\",LARGE(AA15:AA21,1)+1)","v":""},null,"❽  Nombre de portions prévues par l'Auteur",null,null,null,null,null,null,null,"Lien>","https://www.exceltip.com/events-in-vba/the-worksheet-events-in-excel-vba.html"]
[null,{"$f":"IF(ISBLANK(C23),\"\",LARGE(B16:B22,1)+1)","v":""},null,"si vous ne voulez pas de numérotation",null,null,null,null,null,null,null,"si vous ne voulez pas de numérotation",{"$f":"+IF(ISBLANK(L23),\"\",LARGE(M15:M22,1)+1)","v":7},null,null,{"$f":"IF(ISBLANK(Q23),\"\",LARGE(P16:P22,1)+1)","v":""},null,"si vous ne voulez pas de numérotation",null,null,null,null,null,null,null,"si vous ne voulez pas de numérotation",{"$f":"+IF(ISBLANK(Z23),\"\",LARGE(AA15:AA22,1)+1)","v":7},null,"Poids total Auteur ⑨ somme des colonnes ❺  Poids",null,null,null,null,null,null,null,"Lien>","https://www.excel-pratique.com/fr/vba/evenements_feuille"]
[null,{"$f":"IF(ISBLANK(C24),\"\",LARGE(B16:B23,1)+1)","v":""},null,"saisissez votre texte dans la colonne D ou K",null,null,null,null,null,null,"saisissez votre texte dans la colonne K",null,{"$f":"+IF(ISBLANK(L24),\"\",LARGE(M15:M23,1)+1)","v":""},null,null,{"$f":"IF(ISBLANK(Q24),\"\",LARGE(P16:P23,1)+1)","v":""},null,"saisissez votre texte dans la colonne D ou K",null,null,null,null,null,null,"saisissez votre texte dans la colonne K",null,{"$f":"+IF(ISBLANK(Z24),\"\",LARGE(AA15:AA23,1)+1)","v":""},null,"formule utilisée","SI(ESTVIDE(B34);C34;B34*C34)+SI(ESTVIDE(B35);C35;B35*C35) etc.."]
[null,{"$f":"IF(ISBLANK(C25),\"\",LARGE(B16:B24,1)+1)","v":""},null,null,null,null,null,null,null,null,null,null,{"$f":"+IF(ISBLANK(L25),\"\",LARGE(M15:M24,1)+1)","v":""},null,null,{"$f":"IF(ISBLANK(Q25),\"\",LARGE(P16:P24,1)+1)","v":""},null,null,null,null,null,null,null,null,null,null,{"$f":"+IF(ISBLANK(Z25),\"\",LARGE(AA15:AA24,1)+1)","v":""},null,"cette formule multiplie les  Unités ❹  mais n'additionne que les Poids ❺",null,null,null,null,null,null,null,"lien >","Les unités pifométriques"]
[null,{"$f":"IF(ISBLANK(C26),\"\",LARGE(B16:B25,1)+1)","v":""},null,null,null,null,null,null,null,null,null,null,{"$f":"+IF(ISBLANK(L26),\"\",LARGE(M15:M25,1)+1)","v":""},null,null,{"$f":"IF(ISBLANK(Q26),\"\",LARGE(P16:P25,1)+1)","v":""},null,null,null,null,null,null,null,null,null,null,{"$f":"+IF(ISBLANK(Z26),\"\",LARGE(AA15:AA25,1)+1)","v":""}]
[null,{"$f":"+IF(ISBLANK(C27),\"\",LARGE(B16:B26,1)+1)","v":""},null,null,null,null,null,null,null,null,null,null,{"$f":"+IF(ISBLANK(L27),\"\",LARGE(M15:M26,1)+1)","v":""},null,null,{"$f":"+IF(ISBLANK(Q27),\"\",LARGE(P16:P26,1)+1)","v":""},null,null,null,null,null,null,null,null,null,null,{"$f":"+IF(ISBLANK(Z27),\"\",LARGE(AA15:AA26,1)+1)","v":""},null,"⑩ poids pour 1 portion",null,null,null,null,null,null,null,"Impression Portrait 1 recette par feuille A4"]
[null,{"$f":"IF(ISBLANK(C28),\"\",LARGE(B16:B27,1)+1)","v":""},null,null,null,null,null,null,null,null,null,null,{"$f":"+IF(ISBLANK(L28),\"\",LARGE(M15:M27,1)+1)","v":""},null,null,{"$f":"IF(ISBLANK(Q28),\"\",LARGE(P16:P27,1)+1)","v":""},null,null,null,null,null,null,null,null,null,null,{"$f":"+IF(ISBLANK(Z28),\"\",LARGE(AA15:AA27,1)+1)","v":""},null,"Vous pouvez intervenir sur le poids portion ⑩ en augmentant ou en diminuant le nombre de portions ❽"]
[null,{"$f":"IF(ISBLANK(C29),\"\",LARGE(B16:B28,1)+1)","v":""},null,null,null,null,null,null,null,null,null,null,{"$f":"+IF(ISBLANK(L29),\"\",LARGE(M15:M28,1)+1)","v":""},null,null,{"$f":"IF(ISBLANK(Q29),\"\",LARGE(P16:P28,1)+1)","v":""},null,null,null,null,null,null,null,null,null,null,{"$f":"+IF(ISBLANK(Z29),\"\",LARGE(AA15:AA28,1)+1)","v":""},null,null,null,null,null,null,null,null,null,{"$f":"\"Page \"&_xlfn.SHEET()&\" sur \"&_xlfn.SHEETS()","v":"Page 8 sur 16"}]
[null,{"$f":"IF(ISBLANK(C30),\"\",LARGE(B16:B29,1)+1)","v":""},null,null,null,null,null,null,null,null,null,null,{"$f":"+IF(ISBLANK(L30),\"\",LARGE(M15:M29,1)+1)","v":""},null,null,{"$f":"IF(ISBLANK(Q30),\"\",LARGE(P16:P29,1)+1)","v":""},null,null,null,null,null,null,null,null,null,null,{"$f":"+IF(ISBLANK(Z30),\"\",LARGE(AA15:AA29,1)+1)","v":""}]
[null,{"$f":"IF(ISBLANK(C31),\"\",LARGE(B16:B30,1)+1)","v":""},null,null,null,null,null,null,null,null,null,null,{"$f":"+IF(ISBLANK(L31),\"\",LARGE(M15:M30,1)+1)","v":""},null,null,{"$f":"IF(ISBLANK(Q31),\"\",LARGE(P16:P30,1)+1)","v":""},null,null,null,null,null,null,null,null,null,null,{"$f":"+IF(ISBLANK(Z31),\"\",LARGE(AA15:AA30,1)+1)","v":""},null,"⓫ Combien de Portions voulez vous faire",null,null,null,null,null,null,null,"Avant de saisir quoi que ce soit dans une cellule - cliquez dessus pour vérifier qu'il n'y ait pas de formule"]
[null,"❹ Unités","❺  Poids","❸ Ingrédients","⑦ Quantités","%","❻ Quoi","❹ Unités","❺  Poids","❸ Ingrédients","⑦ Quantités","%","❻ Quoi",null,null,"❹ Unités","❺  Poids","❸ Ingrédients","⑦ Quantités","%","❻ Quoi","❹ Unités","❺  Poids","❸ Ingrédients","⑦ Quantités","%","❻ Quoi",null,null,"⑫ Poids à fabriquer = ⑩ X ⓫"]
[null,null,null,"S.Total saisi >",{"$f":"IF(ISNUMBER(C34),E34)+IF(ISNUMBER(C35),E35)+IF(ISNUMBER(C36),E36)+IF(ISNUMBER(C37),E37)+IF(ISNUMBER(C38),E38)+IF(ISNUMBER(C39),E39)+IF(ISNUMBER(C40),E40)+IF(ISNUMBER(C41),E41)+IF(ISNUMBER(C42),E42)+IF(ISNUMBER(C43),E43)+IF(ISNUMBER(C44),E44)+IF(ISNUMBER(C45),E45)+IF(ISNUMBER(C46),E46)+IF(ISNUMBER(C47),E47)+IF(ISNUMBER(C48),E48)","v":0.27500000000000002},null,null,null,null,"S.Total saisi >",{"$f":"IF(ISNUMBER(I34),K34)+IF(ISNUMBER(I35),K35)+IF(ISNUMBER(I36),K36)+IF(ISNUMBER(I37),K37)+IF(ISNUMBER(I38),K38)+IF(ISNUMBER(I39),K39)+IF(ISNUMBER(I40),K40)+IF(ISNUMBER(I41),K41)+IF(ISNUMBER(I42),K42)+IF(ISNUMBER(I43),K43)+IF(ISNUMBER(I44),K44)+IF(ISNUMBER(I45),K45)+IF(ISNUMBER(I46),K46)+IF(ISNUMBER(I47),K47)+IF(ISNUMBER(I48),K48)","v":0},null,null,null,null,null,null,"S.Total saisi >",{"$f":"IF(ISNUMBER(Q34),S34)+IF(ISNUMBER(Q35),S35)+IF(ISNUMBER(Q36),S36)+IF(ISNUMBER(Q37),S37)+IF(ISNUMBER(Q38),S38)+IF(ISNUMBER(Q39),S39)+IF(ISNUMBER(Q40),S40)+IF(ISNUMBER(Q41),S41)+IF(ISNUMBER(Q42),S42)+IF(ISNUMBER(Q43),S43)+IF(ISNUMBER(Q44),S44)+IF(ISNUMBER(Q45),S45)+IF(ISNUMBER(Q46),S46)+IF(ISNUMBER(Q47),S47)+IF(ISNUMBER(Q48),S48)","v":0.27500000000000002},null,null,null,null,"S.Total saisi >",{"$f":"IF(ISNUMBER(W34),Y34)+IF(ISNUMBER(W35),Y35)+IF(ISNUMBER(W36),Y36)+IF(ISNUMBER(W37),Y37)+IF(ISNUMBER(W38),Y38)+IF(ISNUMBER(W39),Y39)+IF(ISNUMBER(W40),Y40)+IF(ISNUMBER(W41),Y41)+IF(ISNUMBER(W42),Y42)+IF(ISNUMBER(W43),Y43)+IF(ISNUMBER(W44),Y44)+IF(ISNUMBER(W45),Y45)+IF(ISNUMBER(W46),Y46)+IF(ISNUMBER(W47),Y47)+IF(ISNUMBER(W48),Y48)","v":0},null,null,null,null,"⑬ Contrôle Total saisi somme des colonnes ⑦ Quantités"]
[null,8,0.05,"œufs",{"$f":"IF(ISBLANK(B34),C34/B11*L11,IF(ISBLANK(C34),B34/B11*L11,(B34*C34)/B11*L11))","v":0.2},{"$f":"IF(ISNUMBER(C34),E34/L13,\"\")","v":0.72727272727272729},"Kg",null,null,"Chair à saucisse",{"$f":"IF(ISBLANK(H34),I34/B11*L11,IF(ISBLANK(I34),H34/B11*L11,(H34*I34)/B11*L11))","v":0},{"$f":"IF(ISNUMBER(I34),K34/L13,\"\")","v":""},"Kg",null,null,8,0.05,"œufs",{"$f":"IF(ISBLANK(P34),Q34/P11*Z11,IF(ISBLANK(Q34),P34/P11*Z11,(P34*Q34)/P11*Z11))","v":0.2},{"$f":"IF(ISNUMBER(Q34),S34/Z13,\"\")","v":0.72727272727272729},"Kg",null,null,"Chair à saucisse",{"$f":"IF(ISBLANK(V34),W34/P11*Z11,IF(ISBLANK(W34),V34/P11*Z11,(V34*W34)/P11*Z11))","v":0},{"$f":"IF(ISNUMBER(W34),Y34/Z13,\"\")","v":""},"Kg",null,"formule utilisée","SI(ESTNUM(C34);E34)+SI(ESTNUM(C35);E35) etc.."]
[null,null,0.15,"ou œufs liquides",{"$f":"IF(ISBLANK(B35),C35/B11*L11,IF(ISBLANK(C35),B35/B11*L11,(B35*C35)/B11*L11))","v":7.4999999999999997E-2},{"$f":"IF(ISNUMBER(C35),E35/L13,\"\")","v":0.27272727272727271},"Kg",null,null,null,{"$f":"IF(ISBLANK(H35),I35/B11*L11,IF(ISBLANK(I35),H35/B11*L11,(H35*I35)/B11*L11))","v":0},{"$f":"IF(ISNUMBER(I35),K35/L13,\"\")","v":""},"Kg",null,null,null,0.15,"ou œufs liquides",{"$f":"IF(ISBLANK(P35),Q35/P11*Z11,IF(ISBLANK(Q35),P35/P11*Z11,(P35*Q35)/P11*Z11))","v":7.4999999999999997E-2},{"$f":"IF(ISNUMBER(Q35),S35/Z13,\"\")","v":0.27272727272727271},"Kg",null,null,null,{"$f":"IF(ISBLANK(V35),W35/P11*Z11,IF(ISBLANK(W35),V35/P11*Z11,(V35*W35)/P11*Z11))","v":0},{"$f":"IF(ISNUMBER(W35),Y35/Z13,\"\")","v":""},"Kg",null,"cette formule n'additionne que les quantités ⑦ à condition qu'il y ait eu un nombre saisi en  Poids ❺ "]
[null,3,null,"œufs",{"$f":"IF(ISBLANK(B36),C36/B11*L11,IF(ISBLANK(C36),B36/B11*L11,(B36*C36)/B11*L11))","v":1.5},{"$f":"IF(ISNUMBER(C36),E36/L13,\"\")","v":""},"œufs",null,null,null,{"$f":"IF(ISBLANK(H36),I36/B11*L11,IF(ISBLANK(I36),H36/B11*L11,(H36*I36)/B11*L11))","v":0},{"$f":"IF(ISNUMBER(I36),K36/L13,\"\")","v":""},"Kg",null,null,3,null,"œufs",{"$f":"IF(ISBLANK(P36),Q36/P11*Z11,IF(ISBLANK(Q36),P36/P11*Z11,(P36*Q36)/P11*Z11))","v":1.5},{"$f":"IF(ISNUMBER(Q36),S36/Z13,\"\")","v":""},"œufs",null,null,null,{"$f":"IF(ISBLANK(V36),W36/P11*Z11,IF(ISBLANK(W36),V36/P11*Z11,(V36*W36)/P11*Z11))","v":0},{"$f":"IF(ISNUMBER(W36),Y36/Z13,\"\")","v":""},"Kg"]
[null,null,null,null,{"$f":"IF(ISBLANK(B37),C37/B11*L11,IF(ISBLANK(C37),B37/B11*L11,(B37*C37)/B11*L11))","v":0},{"$f":"IF(ISNUMBER(C37),E37/L13,\"\")","v":""},"Kg",null,null,null,{"$f":"IF(ISBLANK(H37),I37/B11*L11,IF(ISBLANK(I37),H37/B11*L11,(H37*I37)/B11*L11))","v":0},{"$f":"IF(ISNUMBER(I37),K37/L13,\"\")","v":""},"Kg",null,null,null,null,null,{"$f":"IF(ISBLANK(P37),Q37/P11*Z11,IF(ISBLANK(Q37),P37/P11*Z11,(P37*Q37)/P11*Z11))","v":0},{"$f":"IF(ISNUMBER(Q37),S37/Z13,\"\")","v":""},"Kg",null,null,null,{"$f":"IF(ISBLANK(V37),W37/P11*Z11,IF(ISBLANK(W37),V37/P11*Z11,(V37*W37)/P11*Z11))","v":0},{"$f":"IF(ISNUMBER(W37),Y37/Z13,\"\")","v":""},"Kg",null,"autrement dit elle ne mélange pas ❹ Unités et ❺  Poids sinon allez expliquer à Excel qu'1 œuf ne fait pas 1 Kg"]
[null,null,null,null,{"$f":"IF(ISBLANK(B38),C38/B11*L11,IF(ISBLANK(C38),B38/B11*L11,(B38*C38)/B11*L11))","v":0},{"$f":"IF(ISNUMBER(C38),E38/L13,\"\")","v":""},"Kg",null,null,null,{"$f":"IF(ISBLANK(H38),I38/B11*L11,IF(ISBLANK(I38),H38/B11*L11,(H38*I38)/B11*L11))","v":0},{"$f":"IF(ISNUMBER(I38),K38/L13,\"\")","v":""},"Kg",null,null,null,null,null,{"$f":"IF(ISBLANK(P38),Q38/P11*Z11,IF(ISBLANK(Q38),P38/P11*Z11,(P38*Q38)/P11*Z11))","v":0},{"$f":"IF(ISNUMBER(Q38),S38/Z13,\"\")","v":""},"Kg",null,null,null,{"$f":"IF(ISBLANK(V38),W38/P11*Z11,IF(ISBLANK(W38),V38/P11*Z11,(V38*W38)/P11*Z11))","v":0},{"$f":"IF(ISNUMBER(W38),Y38/Z13,\"\")","v":""},"Kg"]
[null,null,null,null,{"$f":"IF(ISBLANK(B39),C39/B11*L11,IF(ISBLANK(C39),B39/B11*L11,(B39*C39)/B11*L11))","v":0},{"$f":"IF(ISNUMBER(C39),E39/L13,\"\")","v":""},"Kg",null,null,null,{"$f":"IF(ISBLANK(H39),I39/B11*L11,IF(ISBLANK(I39),H39/B11*L11,(H39*I39)/B11*L11))","v":0},{"$f":"IF(ISNUMBER(I39),K39/L13,\"\")","v":""},"Kg",null,null,null,null,null,{"$f":"IF(ISBLANK(P39),Q39/P11*Z11,IF(ISBLANK(Q39),P39/P11*Z11,(P39*Q39)/P11*Z11))","v":0},{"$f":"IF(ISNUMBER(Q39),S39/Z13,\"\")","v":""},"Kg",null,null,null,{"$f":"IF(ISBLANK(V39),W39/P11*Z11,IF(ISBLANK(W39),V39/P11*Z11,(V39*W39)/P11*Z11))","v":0},{"$f":"IF(ISNUMBER(W39),Y39/Z13,\"\")","v":""},"Kg"]
[null,null,null,null,{"$f":"IF(ISBLANK(B40),C40/B11*L11,IF(ISBLANK(C40),B40/B11*L11,(B40*C40)/B11*L11))","v":0},{"$f":"IF(ISNUMBER(C40),E40/L13,\"\")","v":""},"Kg",null,null,null,{"$f":"IF(ISBLANK(H40),I40/B11*L11,IF(ISBLANK(I40),H40/B11*L11,(H40*I40)/B11*L11))","v":0},{"$f":"IF(ISNUMBER(I40),K40/L13,\"\")","v":""},"Kg",null,null,null,null,null,{"$f":"IF(ISBLANK(P40),Q40/P11*Z11,IF(ISBLANK(Q40),P40/P11*Z11,(P40*Q40)/P11*Z11))","v":0},{"$f":"IF(ISNUMBER(Q40),S40/Z13,\"\")","v":""},"Kg",null,null,null,{"$f":"IF(ISBLANK(V40),W40/P11*Z11,IF(ISBLANK(W40),V40/P11*Z11,(V40*W40)/P11*Z11))","v":0},{"$f":"IF(ISNUMBER(W40),Y40/Z13,\"\")","v":""},"Kg",null,"④ PHASES ESSENTIELLES  DE PROGRESSION"]
[null,null,null,null,{"$f":"IF(ISBLANK(B41),C41/B11*L11,IF(ISBLANK(C41),B41/B11*L11,(B41*C41)/B11*L11))","v":0},{"$f":"IF(ISNUMBER(C41),E41/L13,\"\")","v":""},"Kg",null,null,null,{"$f":"IF(ISBLANK(H41),I41/B11*L11,IF(ISBLANK(I41),H41/B11*L11,(H41*I41)/B11*L11))","v":0},{"$f":"IF(ISNUMBER(I41),K41/L13,\"\")","v":""},"Kg",null,null,null,null,null,{"$f":"IF(ISBLANK(P41),Q41/P11*Z11,IF(ISBLANK(Q41),P41/P11*Z11,(P41*Q41)/P11*Z11))","v":0},{"$f":"IF(ISNUMBER(Q41),S41/Z13,\"\")","v":""},"Kg",null,null,null,{"$f":"IF(ISBLANK(V41),W41/P11*Z11,IF(ISBLANK(W41),V41/P11*Z11,(V41*W41)/P11*Z11))","v":0},{"$f":"IF(ISNUMBER(W41),Y41/Z13,\"\")","v":""},"Kg",null,"soyez concis 1 verbe = 1 action"]
[null,null,null,null,{"$f":"IF(ISBLANK(B42),C42/B11*L11,IF(ISBLANK(C42),B42/B11*L11,(B42*C42)/B11*L11))","v":0},{"$f":"IF(ISNUMBER(C42),E42/L13,\"\")","v":""},"Kg",null,null,null,{"$f":"IF(ISBLANK(H42),I42/B11*L11,IF(ISBLANK(I42),H42/B11*L11,(H42*I42)/B11*L11))","v":0},{"$f":"IF(ISNUMBER(I42),K42/L13,\"\")","v":""},"Kg",null,null,null,null,null,{"$f":"IF(ISBLANK(P42),Q42/P11*Z11,IF(ISBLANK(Q42),P42/P11*Z11,(P42*Q42)/P11*Z11))","v":0},{"$f":"IF(ISNUMBER(Q42),S42/Z13,\"\")","v":""},"Kg",null,null,null,{"$f":"IF(ISBLANK(V42),W42/P11*Z11,IF(ISBLANK(W42),V42/P11*Z11,(V42*W42)/P11*Z11))","v":0},{"$f":"IF(ISNUMBER(W42),Y42/Z13,\"\")","v":""},"Kg",null,"Utilisez le vocabulaire professionnel"]
[null,null,null,null,{"$f":"IF(ISBLANK(B43),C43/B11*L11,IF(ISBLANK(C43),B43/B11*L11,(B43*C43)/B11*L11))","v":0},{"$f":"IF(ISNUMBER(C43),E43/L13,\"\")","v":""},"Kg",null,null,null,{"$f":"IF(ISBLANK(H43),I43/B11*L11,IF(ISBLANK(I43),H43/B11*L11,(H43*I43)/B11*L11))","v":0},{"$f":"IF(ISNUMBER(I43),K43/L13,\"\")","v":""},"Kg",null,null,null,null,null,{"$f":"IF(ISBLANK(P43),Q43/P11*Z11,IF(ISBLANK(Q43),P43/P11*Z11,(P43*Q43)/P11*Z11))","v":0},{"$f":"IF(ISNUMBER(Q43),S43/Z13,\"\")","v":""},"Kg",null,null,null,{"$f":"IF(ISBLANK(V43),W43/P11*Z11,IF(ISBLANK(W43),V43/P11*Z11,(V43*W43)/P11*Z11))","v":0},{"$f":"IF(ISNUMBER(W43),Y43/Z13,\"\")","v":""},"Kg",null,"la numérotation est automatique"]
[null,null,null,null,{"$f":"IF(ISBLANK(B44),C44/B11*L11,IF(ISBLANK(C44),B44/B11*L11,(B44*C44)/B11*L11))","v":0},{"$f":"IF(ISNUMBER(C44),E44/L13,\"\")","v":""},"Kg",null,null,null,{"$f":"IF(ISBLANK(H44),I44/B11*L11,IF(ISBLANK(I44),H44/B11*L11,(H44*I44)/B11*L11))","v":0},{"$f":"IF(ISNUMBER(I44),K44/L13,\"\")","v":""},"Kg",null,null,null,null,null,{"$f":"IF(ISBLANK(P44),Q44/P11*Z11,IF(ISBLANK(Q44),P44/P11*Z11,(P44*Q44)/P11*Z11))","v":0},{"$f":"IF(ISNUMBER(Q44),S44/Z13,\"\")","v":""},"Kg",null,null,null,{"$f":"IF(ISBLANK(V44),W44/P11*Z11,IF(ISBLANK(W44),V44/P11*Z11,(V44*W44)/P11*Z11))","v":0},{"$f":"IF(ISNUMBER(W44),Y44/Z13,\"\")","v":""},"Kg",null,null,"lorsque vous saisissez du texte"]
[null,null,null,null,{"$f":"IF(ISBLANK(B45),C45/B11*L11,IF(ISBLANK(C45),B45/B11*L11,(B45*C45)/B11*L11))","v":0},{"$f":"IF(ISNUMBER(C45),E45/L13,\"\")","v":""},"Kg",null,null,null,{"$f":"IF(ISBLANK(H45),I45/B11*L11,IF(ISBLANK(I45),H45/B11*L11,(H45*I45)/B11*L11))","v":0},{"$f":"IF(ISNUMBER(I45),K45/L13,\"\")","v":""},"Kg",null,null,null,null,null,{"$f":"IF(ISBLANK(P45),Q45/P11*Z11,IF(ISBLANK(Q45),P45/P11*Z11,(P45*Q45)/P11*Z11))","v":0},{"$f":"IF(ISNUMBER(Q45),S45/Z13,\"\")","v":""},"Kg",null,null,null,{"$f":"IF(ISBLANK(V45),W45/P11*Z11,IF(ISBLANK(W45),V45/P11*Z11,(V45*W45)/P11*Z11))","v":0},{"$f":"IF(ISNUMBER(W45),Y45/Z13,\"\")","v":""},"Kg",null,"dans la colonne C ou dans la colonne L"]
[null,null,null,null,{"$f":"IF(ISBLANK(B46),C46/B11*L11,IF(ISBLANK(C46),B46/B11*L11,(B46*C46)/B11*L11))","v":0},{"$f":"IF(ISNUMBER(C46),E46/L13,\"\")","v":""},"Kg",null,null,null,{"$f":"IF(ISBLANK(H46),I46/B11*L11,IF(ISBLANK(I46),H46/B11*L11,(H46*I46)/B11*L11))","v":0},{"$f":"IF(ISNUMBER(I46),K46/L13,\"\")","v":""},"Kg",null,null,null,null,null,{"$f":"IF(ISBLANK(P46),Q46/P11*Z11,IF(ISBLANK(Q46),P46/P11*Z11,(P46*Q46)/P11*Z11))","v":0},{"$f":"IF(ISNUMBER(Q46),S46/Z13,\"\")","v":""},"Kg",null,null,null,{"$f":"IF(ISBLANK(V46),W46/P11*Z11,IF(ISBLANK(W46),V46/P11*Z11,(V46*W46)/P11*Z11))","v":0},{"$f":"IF(ISNUMBER(W46),Y46/Z13,\"\")","v":""},"Kg",null,null,"si vous ne voulez pas de numérotation"]
[null,null,null,null,{"$f":"IF(ISBLANK(B47),C47/B11*L11,IF(ISBLANK(C47),B47/B11*L11,(B47*C47)/B11*L11))","v":0},{"$f":"IF(ISNUMBER(C47),E47/L13,\"\")","v":""},"Kg",null,null,null,{"$f":"IF(ISBLANK(H47),I47/B11*L11,IF(ISBLANK(I47),H47/B11*L11,(H47*I47)/B11*L11))","v":0},{"$f":"IF(ISNUMBER(I47),K47/L13,\"\")","v":""},"Kg",null,null,null,null,null,{"$f":"IF(ISBLANK(P47),Q47/P11*Z11,IF(ISBLANK(Q47),P47/P11*Z11,(P47*Q47)/P11*Z11))","v":0},{"$f":"IF(ISNUMBER(Q47),S47/Z13,\"\")","v":""},"Kg",null,null,null,{"$f":"IF(ISBLANK(V47),W47/P11*Z11,IF(ISBLANK(W47),V47/P11*Z11,(V47*W47)/P11*Z11))","v":0},{"$f":"IF(ISNUMBER(W47),Y47/Z13,\"\")","v":""},"Kg",null,null,"saisissez votre texte dans la colonne D ou K"]
[null,null,null,null,{"$f":"IF(ISBLANK(B48),C48/B11*L11,IF(ISBLANK(C48),B48/B11*L11,(B48*C48)/B11*L11))","v":0},{"$f":"IF(ISNUMBER(C48),E48/L13,\"\")","v":""},"Kg",null,null,null,{"$f":"IF(ISBLANK(H48),I48/B11*L11,IF(ISBLANK(I48),H48/B11*L11,(H48*I48)/B11*L11))","v":0},{"$f":"IF(ISNUMBER(I48),K48/L13,\"\")","v":""},"Kg",null,null,null,null,null,{"$f":"IF(ISBLANK(P48),Q48/P11*Z11,IF(ISBLANK(Q48),P48/P11*Z11,(P48*Q48)/P11*Z11))","v":0},{"$f":"IF(ISNUMBER(Q48),S48/Z13,\"\")","v":""},"Kg",null,null,null,{"$f":"IF(ISBLANK(V48),W48/P11*Z11,IF(ISBLANK(W48),V48/P11*Z11,(V48*W48)/P11*Z11))","v":0},{"$f":"IF(ISNUMBER(W48),Y48/Z13,\"\")","v":""},"Kg",null,"formule utilisée :"]
[null,null,null,null,null,null,null,null,null,null,null,null,null,null,null,null,null,null,null,null,null,null,null,null,null,null,null,null,"colonne B"]
[null,null,{"$f":"IF(ISBLANK(B34),C34,B34*C34)+IF(ISBLANK(B35),C35,B35*C35)+IF(ISBLANK(B36),C36,B36*C36)+IF(ISBLANK(B37),C37,B37*C37)+IF(ISBLANK(B38),C38,B38*C38)+IF(ISBLANK(B39),C39,B39*C39)+IF(ISBLANK(B40),C40,B40*C40)+IF(ISBLANK(B41),C41,B41*C41)+IF(ISBLANK(B42),C42,B42*C42)+IF(ISBLANK(B43),C43,B43*C43)+IF(ISBLANK(B44),C44,B44*C44)+IF(ISBLANK(B45),C45,B45*C45)+IF(ISBLANK(B46),C46,B46*C46)+IF(ISBLANK(B47),C47,B47*C47)+IF(ISBLANK(B48),C48,B48*C48)","v":0.55000000000000004},"< S.total Auteur  - S.total saisi >",{"$f":"IF(ISNUMBER(C34),E34)+IF(ISNUMBER(C35),E35)+IF(ISNUMBER(C36),E36)+IF(ISNUMBER(C37),E37)+IF(ISNUMBER(C38),E38)+IF(ISNUMBER(C39),E39)+IF(ISNUMBER(C40),E40)+IF(ISNUMBER(C41),E41)+IF(ISNUMBER(C42),E42)+IF(ISNUMBER(C43),E43)+IF(ISNUMBER(C44),E44)+IF(ISNUMBER(C45),E45)+IF(ISNUMBER(C46),E46)+IF(ISNUMBER(C47),E47)+IF(ISNUMBER(C48),E48)","v":0.27500000000000002},null,null,"S.total Auteur >",{"$f":"IF(ISBLANK(H34),I34,H34*I34)+IF(ISBLANK(H35),I35,H35*I35)+IF(ISBLANK(H36),I36,H36*I36)+IF(ISBLANK(H37),I37,H37*I37)+IF(ISBLANK(H38),I38,H38*I38)+IF(ISBLANK(H39),I39,H39*I39)+IF(ISBLANK(H40),I40,H40*I40)+IF(ISBLANK(H41),I41,H41*I41)+IF(ISBLANK(H42),I42,H42*I42)+IF(ISBLANK(H43),I43,H43*I43)+IF(ISBLANK(H44),I44,H44*I44)+IF(ISBLANK(H45),I45,H45*I45)+IF(ISBLANK(H46),I46,H46*I46)+IF(ISBLANK(H47),I47,H47*I47)+IF(ISBLANK(H48),I48,H48*I48)+IF(ISBLANK(H49),I49,H49*I49)","v":0},null,"Total Auteur >",{"$f":"I50+C50","v":0.55000000000000004},null,null,null,null,{"$f":"IF(ISBLANK(P34),Q34,P34*Q34)+IF(ISBLANK(P35),Q35,P35*Q35)+IF(ISBLANK(P36),Q36,P36*Q36)+IF(ISBLANK(P37),Q37,P37*Q37)+IF(ISBLANK(P38),Q38,P38*Q38)+IF(ISBLANK(P39),Q39,P39*Q39)+IF(ISBLANK(P40),Q40,P40*Q40)+IF(ISBLANK(P41),Q41,P41*Q41)+IF(ISBLANK(P42),Q42,P42*Q42)+IF(ISBLANK(P43),Q43,P43*Q43)+IF(ISBLANK(P44),Q44,P44*Q44)+IF(ISBLANK(P45),Q45,P45*Q45)+IF(ISBLANK(P46),Q46,P46*Q46)+IF(ISBLANK(P47),Q47,P47*Q47)+IF(ISBLANK(P48),Q48,P48*Q48)","v":0.55000000000000004},"< S.total Auteur  - S.total saisi >",{"$f":"IF(ISNUMBER(Q34),S34)+IF(ISNUMBER(Q35),S35)+IF(ISNUMBER(Q36),S36)+IF(ISNUMBER(Q37),S37)+IF(ISNUMBER(Q38),S38)+IF(ISNUMBER(Q39),S39)+IF(ISNUMBER(Q40),S40)+IF(ISNUMBER(Q41),S41)+IF(ISNUMBER(Q42),S42)+IF(ISNUMBER(Q43),S43)+IF(ISNUMBER(Q44),S44)+IF(ISNUMBER(Q45),S45)+IF(ISNUMBER(Q46),S46)+IF(ISNUMBER(Q47),S47)+IF(ISNUMBER(Q48),S48)","v":0.27500000000000002},null,null,"S.total Auteur >",{"$f":"IF(ISBLANK(V34),W34,V34*W34)+IF(ISBLANK(V35),W35,V35*W35)+IF(ISBLANK(V36),W36,V36*W36)+IF(ISBLANK(V37),W37,V37*W37)+IF(ISBLANK(V38),W38,V38*W38)+IF(ISBLANK(V39),W39,V39*W39)+IF(ISBLANK(V40),W40,V40*W40)+IF(ISBLANK(V41),W41,V41*W41)+IF(ISBLANK(V42),W42,V42*W42)+IF(ISBLANK(V43),W43,V43*W43)+IF(ISBLANK(V44),W44,V44*W44)+IF(ISBLANK(V45),W45,V45*W45)+IF(ISBLANK(V46),W46,V46*W46)+IF(ISBLANK(V47),W47,V47*W47)+IF(ISBLANK(V48),W48,V48*W48)+IF(ISBLANK(V49),W49,V49*W49)","v":0},null,"Total Auteur >",{"$f":"W50+Q50","v":0.55000000000000004},null,null,"SI(ESTVIDE(C27);\"\";GRANDE.VALEUR(B16:B26;1)+1)",null,null,null,"Colonne M"]
[null,{"$f":"CELL(\"nomfichier\")","v":"E:\\0-UPRT\\1-UPRT.FR-SITE-WEB\\re-recettes-jean-marc-catteau\\re-catteau-galettes\\[GA-pate.sud.finistere.xlsm]Modes.d'emploi"},null,null,null,null,null,null,null,null,null,null,null,null,null,{"$f":"CELL(\"nomfichier\")","v":"E:\\0-UPRT\\1-UPRT.FR-SITE-WEB\\re-recettes-jean-marc-catteau\\re-catteau-galettes\\[GA-pate.sud.finistere.xlsm]Modes.d'emploi"},null,null,null,null,null,null,null,null,null,null,null,null,null,null,null,null,"SI(ESTVIDE(L27);\"\";GRANDE.VALEUR(M15:M26;1)+1)"]
[null,"Adaptation : Joël Leboucher..UPRT \"Union des Personnels de la Restauration Territoriale\"  membre du réseau RESTAU'CO",null,null,null,null,null,null,null,null,null,null,null,null,null,"Adaptation : Joël Leboucher..UPRT \"Union des Personnels de la Restauration Territoriale\"  membre du réseau RESTAU'CO",null,null,null,null,null,null,null,null,null,null,null,null,12,12,19,12,12,"< Largeurs de colonnes"]
[null,5,11,30,12,11,10,5,11,30,12,11,10,"< Largeurs de colonnes",null,5,11,30,12,11,10,5,11,30,12,11,10]
[]
[]
[null,"① ","Servez vous du pinceau Mise en forme pour changer les couleurs d'entête des recettes ou collez celles-ci à la place",null,null,null,null,null,null,null,null,"Codes ou N°",null,null,null,"① ","Servez vous du pinceau Mise en forme pour changer les couleurs d'entête des recettes ou collez celles-ci à la place",null,null,null,null,null,null,null,null,"Codes ou N°"]
[]
[]
["ICI","① ","DIVERS",null,null,null,null,null,null,null,null,"DIV001",null,null,"ICI","① ","DIVERS",null,null,null,null,null,null,null,null,"DIV001"]
[]
[]
["ICI","① ","brun PATISSERIE",null,null,null,null,null,null,null,null,"PAT001",null,null,"ICI","① ","brun PATISSERIE",null,null,null,null,null,null,null,null,"PAT001"]
[]
[]
["ICI","① ","bleu vert DESSERTS",null,null,null,null,null,null,null,null,"DES001",null,null,"ICI","① ","bleu vert DESSERTS",null,null,null,null,null,null,null,null,"DES001"]
[]
[]
["ICI","① ","bleu LAITAGES FROMAGES",null,null,null,null,null,null,null,null,"LAI001",null,null,"ICI","① ","bleu LAITAGES FROMAGES",null,null,null,null,null,null,null,null,"LAI001"]
[]
[]
["ICI","① ","bleu moyen LAITAGES + FÉCULENTS",null,null,null,null,null,null,null,null,"LFC001",null,null,"ICI","① ","bleu moyen LAITAGES + FÉCULENTS",null,null,null,null,null,null,null,null,"LFC001"]
[]
[]
["ICI","① ","vert brillant ACCOMPAGNEMENT COMPOSÉS VERTS",null,null,null,null,null,null,null,null,"ACC001",null,null,"ICI","① ","vert brillant ACCOMPAGNEMENT COMPOSÉS VERTS",null,null,null,null,null,null,null,null,"ACC001"]
[]
[]
["ICI","① ","orange PLATS COMPLETS",null,null,null,null,null,null,null,null,"PLC001",null,null,"ICI","① ","orange PLATS COMPLETS",null,null,null,null,null,null,null,null,"PLC001"]
[]
[]
["ICI","① ","bleu ciel  POISSON",null,null,null,null,null,null,null,null,"POI001",null,null,"ICI","① ","bleu ciel  POISSON",null,null,null,null,null,null,null,null,"POI001"]
[]
[]
["ICI","① ","or VOLAILLES",null,null,null,null,null,null,null,null,"VOL001",null,null,"ICI","① ","or VOLAILLES",null,null,null,null,null,null,null,null,"VOL001"]
[null,null,null,null,null,null,null,null,null,null,null,null,null,null,null,null,null,null,null,null,null,null,null,null,null,null,null,null,null,null,null,null,null,null,null,null,null,null,null,null,0]
[null,null,null,null,null,null,null,null,null,null,null,null,null,null,null,null,null,null,null,null,null,null,null,null,null,null,null,null,null,null,null,null,null,null,null,null,null,null,null,null,0]
["ICI","① ","rouge VIANDE",null,null,null,null,null,null,null,null,"VIA001",null,null,"ICI","① ","rouge VIANDE",null,null,null,null,null,null,null,null,"VIA001",null,null,null,null,null,null,null,null,null,null,null,null,null,null,0]
[null,null,null,null,null,null,null,null,null,null,null,null,null,null,null,null,null,null,null,null,null,null,null,null,null,null,null,null,null,null,null,null,null,null,null,null,null,null,null,null,0]
[null,null,null,null,null,null,null,null,null,null,null,null,null,null,null,null,null,null,null,null,null,null,null,null,null,null,null,null,null,null,null,null,null,null,null,null,null,null,null,null,0]
["ICI","① ","rose PLAT PRINCIPAL",null,null,null,null,null,null,null,null,"PLA001",null,null,"ICI","① ","rose PLAT PRINCIPAL",null,null,null,null,null,null,null,null,"PLA001",null,null,null,null,null,null,null,null,null,null,null,null,null,null,0]
[null,null,null,null,null,null,null,null,null,null,null,null,null,null,null,null,null,null,null,null,null,null,null,null,null,null,null,null,null,null,null,null,null,null,null,null,null,null,null,null,0]
[null,null,null,null,null,null,null,null,null,null,null,null,null,null,null,null,null,null,null,null,null,null,null,null,null,null,null,null,null,null,null,null,null,null,null,null,null,null,null,null,0]
["ICI","① ","marron FÉCULENTS",null,null,null,null,null,null,null,null,"FEC001",null,null,"ICI","① ","marron FÉCULENTS",null,null,null,null,null,null,null,null,"FEC001",null,null,null,null,null,null,null,null,null,null,null,null,null,null,0]
[null,null,null,null,null,null,null,null,null,null,null,null,null,null,null,null,null,null,null,null,null,null,null,null,null,null,null,null,null,null,null,null,null,null,null,null,null,null,null,null,0]
[null,null,null,null,null,null,null,null,null,null,null,null,null,null,null,null,null,null,null,null,null,null,null,null,null,null,null,null,null,null,null,null,null,null,null,null,null,null,null,null,0]
["ICI","① ","citron vert CUIDITÉS",null,null,null,null,null,null,null,null,"CUI001",null,null,"ICI","① ","citron vert CUIDITÉS",null,null,null,null,null,null,null,null,"CUI001",null,null,null,null,null,null,null,null,null,null,null,null,null,null,0]
[null,null,null,null,null,null,null,null,null,null,null,null,null,null,null,null,null,null,null,null,null,null,null,null,null,null,null,null,null,null,null,null,null,null,null,null,null,null,null,null,0]
[null,null,null,null,null,null,null,null,null,null,null,null,null,null,null,null,null,null,null,null,null,null,null,null,null,null,null,null,null,null,null,null,null,null,null,null,null,null,null,null,0]
["ICI","① ","vert CRUDITÉS",null,null,null,null,null,null,null,null,"CRU001",null,null,"ICI","① ","vert CRUDITÉS",null,null,null,null,null,null,null,null,"CRU001",null,null,null,null,null,null,null,null,null,null,null,null,null,null,0]
[null,null,null,null,null,null,null,null,null,null,null,null,null,null,null,null,null,null,null,null,null,null,null,null,null,null,null,null,null,null,null,null,null,null,null,null,null,null,null,null,0]
[null,null,null,null,null,null,null,null,null,null,null,null,null,null,null,null,null,null,null,null,null,null,null,null,null,null,null,null,null,null,null,null,null,null,null,null,null,null,null,null,0]
["ICI","① ","violet  ENTRÉES CHAUDES",null,null,null,null,null,null,null,null,"ENT001",null,null,"ICI","① ","violet  ENTRÉES CHAUDES",null,null,null,null,null,null,null,null,"ENT001",null,null,null,null,null,null,null,null,null,null,null,null,null,null,0]
[null,null,null,null,null,null,null,null,null,null,null,null,null,null,null,null,null,null,null,null,null,null,null,null,null,null,null,null,null,null,null,null,null,null,null,null,null,null,null,null,0]
[null,null,null,null,null,null,null,null,null,null,null,null,null,null,null,null,null,null,null,null,null,null,null,null,null,null,null,null,null,null,null,null,null,null,null,null,null,null,null,null,0]
["ICI","① ","vert marin  ENTRÉES FROIDES",null,null,null,null,null,null,null,null,"ENT001",null,null,"ICI","① ","vert marin  ENTRÉES FROIDES",null,null,null,null,null,null,null,null,"ENT001",null,null,null,null,null,null,null,null,null,null,null,null,null,null,0]
[null,null,null,null,null,null,null,null,null,null,null,null,null,null,null,null,null,null,null,null,null,null,null,null,null,null,null,null,null,null,null,null,null,null,null,null,null,null,null,null,0]
[null,null,null,null,null,null,null,null,null,null,null,null,null,null,null,null,null,null,null,null,null,null,null,null,null,null,null,null,null,null,null,null,null,null,null,null,null,null,null,null,0]
[null,null,null,null,null,null,null,null,null,null,null,null,null,null,null,null,null,null,null,null,null,null,null,null,null,null,null,null,null,null,null,null,null,null,null,null,null,null,null,null,"FIN"]
[null,null,null,null,null,null,null,null,null,null,null,null,null,null,null,null,null,null,null,null,null,null,null,null,null,null,null,null,null,null,null,null,null,null,null,null,null,null,null,null,{"$f":"ADDRESS(ROW(),COLUMN(),4)","v":"AO108"}]

{"sheet":"Vocabulaire","index":8,"n_rows":131,"n_cols":49,"rows_kept":131,"cut":false,"hidden":false,"merged":[[101,48,101,49],[82,48,83,49],[84,48,85,49],[93,48,94,49],[95,48,97,49],[99,48,99,49],[100,48,100,49],[78,48,79,49],[35,48,36,49],[41,48,42,49],[47,48,48,49],[49,47,50,47],[49,48,50,49],[51,47,52,47],[51,48,52,49],[53,48,54,49],[62,47,63,47],[62,48,63,49],[73,47,74,47],[73,48,74,49],[22,44,23,45],[24,44,25,45],[26,47,27,47],[26,48,27,49],[30,47,31,47],[30,48,31,49],[18,48,19,49],[1,22,1,38],[2,1,2,9],[2,11,2,19],[2,43,2,45],[2,47,2,49],[3,43,3,45],[3,47,3,49],[4,44,4,45],[4,48,5,49],[10,48,11,49],[14,48,15,49],[16,48,17,49]]}
[null,"Mise à jour du 14 Décembre 2021",null,null,null,null,null,null,{"$f":"\"Page \"&_xlfn.SHEET()&\" sur \"&_xlfn.SHEETS()","v":"Page 9 sur 16"}]
[null,null,null,null,null,null,null,null,null,null,null,null,null,null,null,null,null,null,null,null,null,null,"VOCABULAIRE PROFESSIONNEL    un verbe…une action",null,null,null,null,null,null,null,null,null,null,null,null,null,null,null,null,null,null,"Le vocabulaire professionnel en pâtisserie"]
[null,"VOCABULAIRE PROFESSIONNEL \" CUISINE DE COMPOSITION\" ",null,null,null,null,null,null,null,null,null,"VOCABULAIRE PROFESSIONNEL \"La CUISINE DE REFERENCE\" Michel MAINCENT",null,null,null,null,null,null,null,null,null,null,"En complément vous avez des liens en bas de page",null,null,null,null,null,null,null,null,null,null,"Quelques verbes d'action complémentaires",null,null,null,null,null,null,null,null,null,"faire court …1 verbe = 1 action",null,null,null,"EXEMPLE UN PEU PLUS LONG :"]
[null,null,"A",null,"E",null,"P",null,"R",null,null,null,"A",null,"D",null,"H",null,"R",null,null,null,"A",null,"D",null,"F",null,"M",null,"R",null,"T",1,"accomplir",null,{"$f":"AH59+1","v":57},"générer",null,null,"Lien >","http://www.juliemyrtille.com/lexique_du_patissier/",null,"PHASES ESSENTIELLES  DE PROGRESSION",null,null,null,"PHASES ESSENTIELLES  DE PROGRESSION"]
[null,1,"Abaisser la temp. à coeur",{"$f":"B22+1","v":16},"Egrener",{"$f":"D26+1","v":32},"Parfumer",{"$f":"F24+1","v":51},"Respecter le délai de 2 H",null,null,1,"Abaisser",{"$f":"L52+1","v":46},"Dépouiller",{"$f":"N52+1","v":91},"Habiller",{"$f":"P52+1","v":130},"Réduire",null,null,1,"Abaisser",{"$f":"V62+1","v":56},"Dauber",{"$f":"X63+1","v":113},"Façonner",{"$f":"Z62+1","v":163},"Macérer",{"$f":"AB62+1","v":217},"Rabattre",{"$f":"AD57+1","v":268},"Tabler",{"$f":"LARGE(AH4:AH4,1)+1","v":2},"acheter",null,{"$f":"LARGE(AK4:AK4,1)+1","v":58},"gérer",null,null,null,"A",null,null,"Exemple pour un filet de sole Duglére",null,null,null,"Exemple pour une brandade de morue Bénédictine"]
[null,{"$f":"LARGE(B5:B5,1)+1","v":2},"Accompagner",{"$f":"LARGE(D5:D5,1)+1","v":17},"Eliminer",{"$f":"LARGE(F5:F5,1)+1","v":33},"Parsemer",{"$f":"LARGE(H5:H5,1)+1","v":52},"Retirer",null,null,{"$f":"LARGE(L5:L5,1)+1","v":2},"Abricoter",{"$f":"LARGE(N5:N5,1)+1","v":47},"Dérober",{"$f":"LARGE(P5:P5,1)+1","v":92},"Hacher",{"$f":"LARGE(R5:R5,1)+1","v":131},"Relever",null,null,{"$f":"LARGE(V5:V5,1)+1","v":2},"Abaisser la temp. à coeur",{"$f":"LARGE(X5:X5,1)+1","v":57},"Décanter",{"$f":"LARGE(Z5:Z5,1)+1","v":114},"Faire bouillir",{"$f":"LARGE(AB5:AB5,1)+1","v":164},"Maintenir en temp. sup à 63°",{"$f":"LARGE(AD5:AD5,1)+1","v":218},"Raccourcir",{"$f":"LARGE(AF5:AF5,1)+1","v":269},"Tailler",{"$f":"LARGE(AH4:AH5,1)+1","v":3},"achever",null,{"$f":"LARGE(AK4:AK5,1)+1","v":59},"identifier",null,null,null,"Abaisse : morceau de pâte que l’on étale au rouleau à une épaisseur voulue",null,1,"habiller les soles"]
[null,{"$f":"LARGE(B5:B6,1)+1","v":3},"Additionner",{"$f":"LARGE(D5:D6,1)+1","v":18},"Enfourner",{"$f":"LARGE(F5:F6,1)+1","v":34},"Peler",{"$f":"LARGE(H5:H6,1)+1","v":53},"Retourner",null,null,{"$f":"LARGE(L5:L6,1)+1","v":3},"Arroser",{"$f":"LARGE(N5:N6,1)+1","v":48},"Désosser",{"$f":"LARGE(P5:P6,1)+1","v":93},"Historier",{"$f":"LARGE(R5:R6,1)+1","v":132},"Remonter",null,null,{"$f":"LARGE(V5:V6,1)+1","v":3},"Abricoter",{"$f":"LARGE(X5:X6,1)+1","v":58},"Décercler",{"$f":"LARGE(Z5:Z6,1)+1","v":115},"Farcir",{"$f":"LARGE(AB5:AB6,1)+1","v":165},"Manchonner",{"$f":"LARGE(AD5:AD6,1)+1","v":219},"Rafraîchir",{"$f":"LARGE(AF5:AF6,1)+1","v":270},"Tamiser",{"$f":"LARGE(AH4:AH6,1)+1","v":4},"activer",null,{"$f":"LARGE(AK4:AK6,1)+1","v":60},"imaginer",null,null,null,"Abaisser : étaler une pâte au rouleau à une épaisseur voulue.",null,2,"les dépouiller",null,null,"❶","Mise en place du poste de travail"]
[null,{"$f":"LARGE(B5:B7,1)+1","v":4},"Adjoindre",{"$f":"LARGE(D5:D7,1)+1","v":19},"Enfourner",{"$f":"LARGE(F5:F7,1)+1","v":35},"Porter à ébullition",{"$f":"LARGE(H5:H7,1)+1","v":54},"Rincer",null,null,{"$f":"LARGE(L5:L7,1)+1","v":4},"Assaisonner",{"$f":"LARGE(N5:N7,1)+1","v":49},"Dessécher",null,"I",{"$f":"LARGE(R5:R7,1)+1","v":133},"Revenir",null,null,{"$f":"LARGE(V5:V7,1)+1","v":4},"Accoler",{"$f":"LARGE(X5:X7,1)+1","v":59},"Décorer",{"$f":"LARGE(Z5:Z7,1)+1","v":116},"Farder",{"$f":"LARGE(AB5:AB7,1)+1","v":166},"Manier",{"$f":"LARGE(AD5:AD7,1)+1","v":220},"Raidir",{"$f":"LARGE(AF5:AF7,1)+1","v":271},"Tamponner",{"$f":"LARGE(AH4:AH7,1)+1","v":5},"agrandir",null,{"$f":"LARGE(AK4:AK7,1)+1","v":61},"inscrire",null,null,null,"Abricoter : étendre une confiture d’abricot à l’aide d’un pinceau sur un entremets, sur une tarte ou une préparation pour la rendre brillante et la protéger en surface en limitant les risques de dessèchement et de brunissement enzymatique.",null,3,"les mettre en filet",null,null,1,"verifier les DLC"]
[null,{"$f":"LARGE(B5:B8,1)+1","v":5},"Agir rapidement",{"$f":"LARGE(D5:D8,1)+1","v":20},"Etaler",{"$f":"LARGE(F5:F8,1)+1","v":36},"Préchauffer",null,"S",null,null,null,"B",{"$f":"LARGE(N5:N8,1)+1","v":50},"Détendre",{"$f":"LARGE(P5:P8,1)+1","v":94},"Inciser",{"$f":"LARGE(R5:R8,1)+1","v":134},"Rissoler",null,null,{"$f":"LARGE(V5:V8,1)+1","v":5},"Accompagner",{"$f":"LARGE(X5:X8,1)+1","v":60},"Décortiquer",{"$f":"LARGE(Z5:Z8,1)+1","v":117},"Fariner",{"$f":"LARGE(AB5:AB8,1)+1","v":167},"Manipuler",{"$f":"LARGE(AD5:AD8,1)+1","v":221},"Rassir",{"$f":"LARGE(AF5:AF8,1)+1","v":272},"Tapisser",{"$f":"LARGE(AH4:AH8,1)+1","v":6},"ajuster",null,{"$f":"LARGE(AK4:AK8,1)+1","v":62},"insérer",null,null,null,"Accoler : réunir, rassembler deux ou plusieurs éléments pour constituer un gâteau, un élément de fabrication ou autre.",null,4,"dégorger le tout 1/2 heure à l'eau fraiche",null,null,2,"peser les denrées"]
[null,{"$f":"LARGE(B5:B9,1)+1","v":6},"Ajouter",null,"F",{"$f":"LARGE(F5:F9,1)+1","v":37},"Prélever",{"$f":"LARGE(H5:H9,1)+1","v":55},"Saupoudrer",null,null,{"$f":"LARGE(L5:L9,1)+1","v":5},"Barder",{"$f":"LARGE(N5:N9,1)+1","v":51},"Dorer",null,"L",{"$f":"LARGE(R5:R9,1)+1","v":135},"Rompre",null,null,{"$f":"LARGE(V5:V9,1)+1","v":6},"Additionner",{"$f":"LARGE(X5:X9,1)+1","v":61},"Décuire",{"$f":"LARGE(Z5:Z9,1)+1","v":118},"Festonner",{"$f":"LARGE(AB5:AB9,1)+1","v":168},"Marbrer",{"$f":"LARGE(AD5:AD9,1)+1","v":222},"Rayer",{"$f":"LARGE(AF5:AF9,1)+1","v":273},"Terminer",{"$f":"LARGE(AH4:AH9,1)+1","v":7},"améliorer",null,{"$f":"LARGE(AK4:AK9,1)+1","v":63},"inspecter",null,null,null,"Appareil : mélange de différentes substances alimentaires entrant dans la composition d’une préparation de pâtisserie.",null,5,"hacher finement oignons et échalotes",null,null,3,"sélectionner le matériel"]
[null,{"$f":"LARGE(B5:B10,1)+1","v":7},"Aplatir",{"$f":"LARGE(D5:D10,1)+1","v":21},"Faire bouillir",{"$f":"LARGE(F5:F10,1)+1","v":38},"Préparer",{"$f":"LARGE(H5:H10,1)+1","v":56},"Servir",null,null,{"$f":"LARGE(L5:L10,1)+1","v":6},"Beurrer",{"$f":"LARGE(N5:N10,1)+1","v":52},"Dresser",{"$f":"LARGE(P5:P10,1)+1","v":95},"Lier",{"$f":"LARGE(R5:R10,1)+1","v":136},"Rôtir",null,null,{"$f":"LARGE(V5:V10,1)+1","v":7},"Adjoindre",{"$f":"LARGE(X5:X10,1)+1","v":62},"Déffilandrer",{"$f":"LARGE(Z5:Z10,1)+1","v":119},"Fileter",{"$f":"LARGE(AB5:AB10,1)+1","v":169},"Mariner",{"$f":"LARGE(AD5:AD10,1)+1","v":223},"Réaliser",{"$f":"LARGE(AF5:AF10,1)+1","v":274},"Tomber",{"$f":"LARGE(AH4:AH10,1)+1","v":8},"aménager",null,{"$f":"LARGE(AK4:AK10,1)+1","v":64},"installer",null,null,null,"Apprêt : technique survenant après le façonnage d’une pâte levée fermentée (pain, brioche…), pour assurer le développement des pièces par la fermentation avant la cuisson.",null,6,"monder  épépiner  concasser les tomates",null,null,4,"désinfecter le matériel et le poste de travail suivant la procédure"]
[null,null,"B",null,"G",{"$f":"LARGE(F5:F11,1)+1","v":39},"Protéger",{"$f":"LARGE(H5:H11,1)+1","v":57},"Snacker",null,null,{"$f":"LARGE(L5:L11,1)+1","v":7},"Blanchir",null,"E",{"$f":"LARGE(P5:P11,1)+1","v":96},"Limoner",null,"S",null,null,{"$f":"LARGE(V5:V11,1)+1","v":8},"Agir rapidement",{"$f":"LARGE(X5:X11,1)+1","v":63},"Déglacer",{"$f":"LARGE(Z5:Z11,1)+1","v":120},"Fixer",{"$f":"LARGE(AB5:AB11,1)+1","v":170},"Marquer",{"$f":"LARGE(AD5:AD11,1)+1","v":224},"Réchauffer en moins d'1 H",{"$f":"LARGE(AF5:AF11,1)+1","v":275},"Torréfier",{"$f":"LARGE(AH4:AH11,1)+1","v":9},"analyser",null,{"$f":"LARGE(AK4:AK11,1)+1","v":65},"inventer",null,null,null,"Aromatiser : incorporer un arôme ou un aromate à une préparation.",null,7,"concasser le persil"]
[null,{"$f":"LARGE(B5:B12,1)+1","v":8},"Battre",{"$f":"LARGE(D5:D12,1)+1","v":22},"Garnir",null,"R",null,"T",null,null,{"$f":"LARGE(L5:L12,1)+1","v":8},"Blondir",{"$f":"LARGE(N5:N12,1)+1","v":53},"Ebarber",{"$f":"LARGE(P5:P12,1)+1","v":97},"Lisser",{"$f":"LARGE(R5:R12,1)+1","v":137},"Saigner",null,null,{"$f":"LARGE(V5:V12,1)+1","v":9},"Ajouter",{"$f":"LARGE(X5:X12,1)+1","v":64},"Dégorger",{"$f":"LARGE(Z5:Z12,1)+1","v":121},"Flamber",{"$f":"LARGE(AB5:AB12,1)+1","v":171},"Masquer",{"$f":"LARGE(AD5:AD12,1)+1","v":225},"Recouvrir",{"$f":"LARGE(AF5:AF12,1)+1","v":276},"Tourer",{"$f":"LARGE(AH4:AH12,1)+1","v":10},"appliquer",null,{"$f":"LARGE(AK4:AK12,1)+1","v":66},"inventorier",null,null,null,"B",null,8,"pocher les filets pliés à très court mouillement"]
[null,null,"C",null,"I",{"$f":"LARGE(F5:F13,1)+1","v":40},"Réaliser",{"$f":"LARGE(H5:H13,1)+1","v":58},"Terminer",null,null,{"$f":"LARGE(L5:L13,1)+1","v":9},"Bouler",{"$f":"LARGE(N5:N13,1)+1","v":54},"Ecailler",{"$f":"LARGE(P5:P13,1)+1","v":98},"Lustrer",{"$f":"LARGE(R5:R13,1)+1","v":138},"Saisir",null,null,{"$f":"LARGE(V5:V13,1)+1","v":10},"Aplatir",{"$f":"LARGE(X5:X13,1)+1","v":65},"Dégourdir",{"$f":"LARGE(Z5:Z13,1)+1","v":122},"Flanquer",{"$f":"LARGE(AB5:AB13,1)+1","v":172},"Masser",{"$f":"LARGE(AD5:AD13,1)+1","v":226},"Rectifier",{"$f":"LARGE(AF5:AF13,1)+1","v":277},"Tourner",{"$f":"LARGE(AH4:AH13,1)+1","v":11},"approuver",null,{"$f":"LARGE(AK4:AK13,1)+1","v":67},"localiser",null,null,null,"Beurrer :",null,null,"sur toute cette garniture avec un peu de vin blanc",null,null,"❷","Préparations préliminaires"]
[null,{"$f":"LARGE(B5:B14,1)+1","v":9},"Chauffer",{"$f":"LARGE(D5:D14,1)+1","v":23},"Incorporer",{"$f":"LARGE(F5:F14,1)+1","v":41},"Réchauffer en moins d'1 H",null,"U",null,null,{"$f":"LARGE(L5:L14,1)+1","v":10},"Braiser",{"$f":"LARGE(N5:N14,1)+1","v":55},"Ecaler",null,"M",{"$f":"LARGE(R5:R14,1)+1","v":139},"Sangler",null,null,{"$f":"LARGE(V5:V14,1)+1","v":11},"Aromatiser",{"$f":"LARGE(X5:X14,1)+1","v":66},"Dégraisser",{"$f":"LARGE(Z5:Z14,1)+1","v":123},"Fleurer",{"$f":"LARGE(AB5:AB14,1)+1","v":173},"Mélanger",{"$f":"LARGE(AD5:AD14,1)+1","v":227},"Réduire",{"$f":"LARGE(AF5:AF14,1)+1","v":278},"Travailler",{"$f":"LARGE(AH4:AH14,1)+1","v":12},"archiver",null,{"$f":"LARGE(AK4:AK14,1)+1","v":68},"maintenir",null,null,null,"– ajouter de beurre à une sauce",null,9,"cuire 4 à 6 mn",null,null,1," La veille, décongeler les filets de morue suivant la procédure."]
[null,{"$f":"LARGE(B5:B15,1)+1","v":10},"Conserver",{"$f":"LARGE(D5:D15,1)+1","v":24},"Indications packaging",{"$f":"LARGE(F5:F15,1)+1","v":42},"Recouvrir",{"$f":"LARGE(H5:H15,1)+1","v":59},"Utiliser",null,null,{"$f":"LARGE(L5:L15,1)+1","v":11},"Brider",{"$f":"LARGE(N5:N15,1)+1","v":56},"Ecorcher",{"$f":"LARGE(P5:P15,1)+1","v":99},"Macérer",{"$f":"LARGE(R5:R15,1)+1","v":140},"Sauter",null,null,{"$f":"LARGE(V5:V15,1)+1","v":12},"Arroser",{"$f":"LARGE(X5:X15,1)+1","v":67},"Déhousser",{"$f":"LARGE(Z5:Z15,1)+1","v":124},"Foisonner",{"$f":"LARGE(AB5:AB15,1)+1","v":174},"Meringuer",{"$f":"LARGE(AD5:AD15,1)+1","v":228},"Refroidir",{"$f":"LARGE(AF5:AF15,1)+1","v":279},"Tremper",{"$f":"LARGE(AH4:AH15,1)+1","v":13},"assembler",null,{"$f":"LARGE(AK4:AK15,1)+1","v":69},"manier",null,null,null,"– enduire un moule ou un ustensile de beurre afin d’empêcher les mets d’attacher au fond ou aux parois.",null,10,"débarrasser les filets sur plat beurré"]
[null,{"$f":"LARGE(B5:B16,1)+1","v":11},"Contrôler",null,"J",{"$f":"LARGE(F5:F16,1)+1","v":43},"Rectifier",null,"V",null,null,null,"C",{"$f":"LARGE(N5:N16,1)+1","v":57},"Ecosser",{"$f":"LARGE(P5:P16,1)+1","v":100},"Manchonner",{"$f":"LARGE(R5:R16,1)+1","v":141},"Serrer",null,null,{"$f":"LARGE(V5:V16,1)+1","v":13},"Assaisonner",{"$f":"LARGE(X5:X16,1)+1","v":68},"Délayer",{"$f":"LARGE(Z5:Z16,1)+1","v":125},"Foncer",{"$f":"LARGE(AB5:AB16,1)+1","v":175},"Mettre au point",{"$f":"LARGE(AD5:AD16,1)+1","v":229},"Régénérer",{"$f":"LARGE(AF5:AF16,1)+1","v":280},"Tronçonner",{"$f":"LARGE(AH4:AH16,1)+1","v":14},"attacher",null,{"$f":"LARGE(AK4:AK16,1)+1","v":70},"manœuvrer",null,null,null,"– incorporer du beurre dans la détrempe d’une pâte feuilletée ou d’une pâte levée feuilletée, pour le tourage.",null,11,"les tenir au chaud",null,null,2," Éventuellement, dessaler par trempage dans un grand volume d'eau."]
[null,null,"D",{"$f":"LARGE(D5:D17,1)+1","v":25},"Jeter",{"$f":"LARGE(F5:F17,1)+1","v":44},"Refroidir",{"$f":"LARGE(H5:H17,1)+1","v":60},"Vérifier la temp.",null,null,{"$f":"LARGE(L5:L17,1)+1","v":12},"Canneler",{"$f":"LARGE(N5:N17,1)+1","v":58},"Ecumer",{"$f":"LARGE(P5:P17,1)+1","v":101},"Marbrer",{"$f":"LARGE(R5:R17,1)+1","v":142},"Singer",null,null,null,"B",{"$f":"LARGE(X5:X17,1)+1","v":69},"Démouler",{"$f":"LARGE(Z5:Z17,1)+1","v":126},"Fondre",{"$f":"LARGE(AB5:AB17,1)+1","v":176},"Mettre en cuisson",{"$f":"LARGE(AD5:AD17,1)+1","v":230},"Réhydrater",{"$f":"LARGE(AF5:AF17,1)+1","v":281},"Trousser",{"$f":"LARGE(AH4:AH17,1)+1","v":15},"attribuer",null,{"$f":"LARGE(AK4:AK17,1)+1","v":71},"mesurer",null,null,null,"Bain-marie : eau plus ou moins chaude dans laquelle on place des récipients contenant des préparations à cuire ou à tenir au chaud.",null,12,"réduire la garniture presque à sec"]
[null,{"$f":"LARGE(B5:B18,1)+1","v":12},"Décorer",null,"L",{"$f":"LARGE(F5:F18,1)+1","v":45},"Réhydrater",{"$f":"LARGE(H5:H18,1)+1","v":61},"Verser",null,null,{"$f":"LARGE(L5:L18,1)+1","v":13},"Caraméliser",{"$f":"LARGE(N5:N18,1)+1","v":59},"Effilandrer",{"$f":"LARGE(P5:P18,1)+1","v":102},"Mariner",{"$f":"LARGE(R5:R18,1)+1","v":143},"Suer",null,null,{"$f":"LARGE(V5:V18,1)+1","v":14},"Barder",{"$f":"LARGE(X5:X18,1)+1","v":70},"Dénerver",{"$f":"LARGE(Z5:Z18,1)+1","v":127},"Fouetter",{"$f":"LARGE(AB5:AB18,1)+1","v":177},"Mijoter",{"$f":"LARGE(AD5:AD18,1)+1","v":231},"Relâcher",{"$f":"LARGE(AF5:AF18,1)+1","v":282},"Turbiner",{"$f":"LARGE(AH4:AH18,1)+1","v":16},"brancher",null,{"$f":"LARGE(AK4:AK18,1)+1","v":72},"mettre",null,null,null,"Battre : agiter vigoureusement une préparation à l’aide d’un fouet, pour la rendre homogène ou lui donner du volume (foisonnement).",null,13,"monter au beurre",null,null,3,"Plaquer les filets sur 5 bacs GN 1/1 H 25 perforés."]
[null,{"$f":"LARGE(B5:B19,1)+1","v":13},"Délayer",{"$f":"LARGE(D5:D19,1)+1","v":26},"Laver",{"$f":"LARGE(F5:F19,1)+1","v":46},"Remonter en température",null,null,null,null,{"$f":"LARGE(L5:L19,1)+1","v":14},"Châtrer",{"$f":"LARGE(N5:N19,1)+1","v":60},"Effiler",{"$f":"LARGE(P5:P19,1)+1","v":103},"Masquer",null,"T",null,null,{"$f":"LARGE(V5:V19,1)+1","v":15},"Battre",{"$f":"LARGE(X5:X19,1)+1","v":71},"Dénoyauter",{"$f":"LARGE(Z5:Z19,1)+1","v":128},"Fouler",{"$f":"LARGE(AB5:AB19,1)+1","v":178},"Mixer",{"$f":"LARGE(AD5:AD19,1)+1","v":232},"Relever",null,null,{"$f":"LARGE(AH4:AH19,1)+1","v":17},"calculer",null,{"$f":"LARGE(AK4:AK19,1)+1","v":73},"moderniser",null,null,null,"Beurre clarifié : beurre fondu et décanté dont on a éliminé de la caséine et du petit lait.",null,14,"napper les filets "]
[null,{"$f":"LARGE(B5:B20,1)+1","v":14},"Disperser",null,"M",{"$f":"LARGE(F5:F20,1)+1","v":47},"Remplacer",null,null,null,null,{"$f":"LARGE(L5:L20,1)+1","v":15},"Chaufroiter",{"$f":"LARGE(N5:N20,1)+1","v":61},"Egermer",{"$f":"LARGE(P5:P20,1)+1","v":104},"Masser",{"$f":"LARGE(R5:R20,1)+1","v":144},"Tailler",null,null,{"$f":"LARGE(V5:V20,1)+1","v":16},"Beurrer",{"$f":"LARGE(X5:X20,1)+1","v":72},"Denteler",{"$f":"LARGE(Z5:Z20,1)+1","v":129},"Fourrer",{"$f":"LARGE(AB5:AB20,1)+1","v":179},"Modeler",{"$f":"LARGE(AD5:AD20,1)+1","v":233},"Remonter en température",null,"U",{"$f":"LARGE(AH4:AH20,1)+1","v":18},"cataloguer",null,{"$f":"LARGE(AK4:AK20,1)+1","v":74},"monter",null,null,null,"Beurre en pommade : beurre ramolli ayant la consistance d’une pommade.",null,15,"servir sans attendre",null,null,4," Mettre les bacs sur l'échelle de four"]
[null,{"$f":"LARGE(B5:B21,1)+1","v":15},"Disposer",{"$f":"LARGE(D5:D21,1)+1","v":27},"Maintenir en temp. sup à 63°",{"$f":"LARGE(F5:F21,1)+1","v":48},"Remuer",null,null,null,null,{"$f":"LARGE(L5:L21,1)+1","v":16},"Chemiser",{"$f":"LARGE(N5:N21,1)+1","v":62},"Egoutter",{"$f":"LARGE(P5:P21,1)+1","v":105},"Meringuer",{"$f":"LARGE(R5:R21,1)+1","v":145},"Tamiser",null,null,{"$f":"LARGE(V5:V21,1)+1","v":17},"Blanchir",{"$f":"LARGE(X5:X21,1)+1","v":73},"Dépouiller",{"$f":"LARGE(Z5:Z21,1)+1","v":130},"Fraiser",{"$f":"LARGE(AB5:AB21,1)+1","v":180},"Moiner",{"$f":"LARGE(AD5:AD21,1)+1","v":234},"Remplacer",{"$f":"LARGE(AF5:AF21,1)+1","v":283},"Upériser",{"$f":"LARGE(AH4:AH21,1)+1","v":19},"centraliser",null,{"$f":"LARGE(AK4:AK21,1)+1","v":75},"naviguer",null,null,null,"Blanchiment : phénomène de déstabilisation d’une fabrication de chocolat, correspondants à la migration en surface des cristaux de sucre, liée à une conservation en atmosphère humide et/ou un travail du chocolat à des températures inadaptées.",null,null,null,null,null,5,"et réserver au froid en attente de cuisson."]
[null,null,null,{"$f":"LARGE(D5:D22,1)+1","v":28},"Manipuler",{"$f":"LARGE(F5:F22,1)+1","v":49},"Répartir",null,null,null,null,{"$f":"LARGE(L5:L22,1)+1","v":17},"Chiqueter",{"$f":"LARGE(N5:N22,1)+1","v":63},"Egrapper",{"$f":"LARGE(P5:P22,1)+1","v":106},"Mijoter",{"$f":"LARGE(R5:R22,1)+1","v":146},"Tamponner",null,null,{"$f":"LARGE(V5:V22,1)+1","v":18},"Blondir",{"$f":"LARGE(X5:X22,1)+1","v":74},"Dérober",{"$f":"LARGE(Z5:Z22,1)+1","v":131},"Frapper",{"$f":"LARGE(AB5:AB22,1)+1","v":181},"Monder",{"$f":"LARGE(AD5:AD22,1)+1","v":235},"Remuer",{"$f":"LARGE(AF5:AF22,1)+1","v":284},"Utiliser",{"$f":"LARGE(AH4:AH22,1)+1","v":20},"chercher",null,{"$f":"LARGE(AK4:AK22,1)+1","v":76},"nettoyer",null,null,null,"Blanchir : travailler ensemble le jaune d’œuf et le sucre au fouet jusqu’à ce que le mélange devienne mousseux.",null,null,"source : Fiches techniques de cuisine Annette et Jean Pierre DOMERGUES",null,null,6," Au cutter, hacher finement l'ail. Réserver."]
[null,null,null,{"$f":"LARGE(D5:D23,1)+1","v":29},"Mélanger",{"$f":"LARGE(F5:F23,1)+1","v":50},"Repasser",null,null,null,null,{"$f":"LARGE(L5:L23,1)+1","v":18},"Ciseler",{"$f":"LARGE(N5:N23,1)+1","v":64},"Egrener",{"$f":"LARGE(P5:P23,1)+1","v":107},"Monder",{"$f":"LARGE(R5:R23,1)+1","v":147},"Tapisser",null,null,{"$f":"LARGE(V5:V23,1)+1","v":19},"Bouler",{"$f":"LARGE(X5:X23,1)+1","v":75},"Désosser",{"$f":"LARGE(Z5:Z23,1)+1","v":132},"Fraser",{"$f":"LARGE(AB5:AB23,1)+1","v":182},"Monter",{"$f":"LARGE(AD5:AD23,1)+1","v":236},"Répartir",null,null,{"$f":"LARGE(AH4:AH23,1)+1","v":21},"classifier",null,{"$f":"LARGE(AK4:AK23,1)+1","v":77},"optimiser",null,null,null,"Bouler : façonner à la main une pâte pour lui donner la forme d’une boule.",null,null,null,null,null,7," Chauffer le lait et le maintenir au chaud."]
[null,null,null,{"$f":"LARGE(D5:D24,1)+1","v":30},"Mettre en cuisson",null,null,null,null,null,null,{"$f":"LARGE(L5:L24,1)+1","v":19},"Citronner",{"$f":"LARGE(N5:N24,1)+1","v":65},"Emincer",{"$f":"LARGE(P5:P24,1)+1","v":108},"Monter",{"$f":"LARGE(R5:R24,1)+1","v":148},"Tourer",null,null,{"$f":"LARGE(V5:V24,1)+1","v":20},"Braiser",{"$f":"LARGE(X5:X24,1)+1","v":76},"Dessécher",{"$f":"LARGE(Z5:Z24,1)+1","v":133},"Frémir",{"$f":"LARGE(AB5:AB24,1)+1","v":183},"Mortifier",{"$f":"LARGE(AD5:AD24,1)+1","v":237},"Repasser",null,"V",{"$f":"LARGE(AH4:AH24,1)+1","v":22},"commander",null,{"$f":"LARGE(AK4:AK24,1)+1","v":78},"ordonnancer",null,null,null,"Brunissement enzymatique : c’est le phénomène qui se produit au contact de l’air à la suite d’opérations ou de traitements de divers végétaux (épluchage, taille) lesquels dégradent la structure végétale externe. Le phénomène conduit à un changement de couleur brun caractéristique du fruit).",null,null,"Editeur DOMERGUES 4  rue de la Bourie Rouge 45 000 ORLÉANS   1981",null,null,8,"Porter à ébullition la crème fraîche "]
[null,null,null,{"$f":"LARGE(D5:D25,1)+1","v":31},"Mixer",null,null,null,null,null,null,{"$f":"LARGE(L5:L25,1)+1","v":20},"Clarifier",{"$f":"LARGE(N5:N25,1)+1","v":66},"Enrober",{"$f":"LARGE(P5:P25,1)+1","v":109},"Mortifier",{"$f":"LARGE(R5:R25,1)+1","v":149},"Tourner",null,null,{"$f":"LARGE(V5:V25,1)+1","v":21},"Brider",{"$f":"LARGE(X5:X25,1)+1","v":77},"Détailler",{"$f":"LARGE(Z5:Z25,1)+1","v":134},"Frire",{"$f":"LARGE(AB5:AB25,1)+1","v":184},"Mouiller",{"$f":"LARGE(AD5:AD25,1)+1","v":238},"Réserver",{"$f":"LARGE(AF5:AF25,1)+1","v":285},"Vanner",{"$f":"LARGE(AH4:AH25,1)+1","v":23},"compiler",null,{"$f":"LARGE(AK4:AK25,1)+1","v":79},"organiser",null,null,null,"C",null,null,null,null,null,9,"et la maintenir au chaud en attente d'utilisation"]
[null,null,null,null,null,null,null,null,null,null,null,{"$f":"LARGE(L5:L26,1)+1","v":21},"Coller",{"$f":"LARGE(N5:N26,1)+1","v":67},"Eplucher",{"$f":"LARGE(P5:P26,1)+1","v":110},"Mouiller",{"$f":"LARGE(R5:R26,1)+1","v":150},"Travailler",null,null,{"$f":"LARGE(V5:V26,1)+1","v":22},"Broyer",{"$f":"LARGE(X5:X26,1)+1","v":78},"Détendre",null,null,{"$f":"LARGE(AB5:AB26,1)+1","v":185},"Mouler",{"$f":"LARGE(AD5:AD26,1)+1","v":239},"Respecter le délai de 2 H",{"$f":"LARGE(AF5:AF26,1)+1","v":286},"Vérifier la temp.",{"$f":"LARGE(AH4:AH26,1)+1","v":24},"compter",null,{"$f":"LARGE(AK4:AK26,1)+1","v":80},"planifier",null,null,null,"Candir : technique qui consiste à immerger des confiseries, des décors, dans un sirop de sucre afin d’obtenir une cristallisation de sucre en surface.",null,null,null,null,null,10,"Au pinceau, badigeonner de beurre 8 bacs GN 1/1 H 65"]
[null,null,null,null,null,null,null,null,null,null,null,{"$f":"LARGE(L5:L27,1)+1","v":22},"Compoter",{"$f":"LARGE(N5:N27,1)+1","v":68},"Escaloper",null,"N",{"$f":"LARGE(R5:R27,1)+1","v":151},"Tremper",null,null,{"$f":"LARGE(V5:V27,1)+1","v":23},"Brûler",{"$f":"LARGE(X5:X27,1)+1","v":79},"Détremper",null,"G",{"$f":"LARGE(AB5:AB27,1)+1","v":186},"Mousser",{"$f":"LARGE(AD5:AD27,1)+1","v":240},"Retirer",{"$f":"LARGE(AF5:AF27,1)+1","v":287},"Verser",{"$f":"LARGE(AH4:AH27,1)+1","v":25},"concevoir",null,{"$f":"LARGE(AK4:AK27,1)+1","v":81},"préparer",null,null,null,"Canneler : c’est le fait de faire de petites cannelures peu profondes à l’aide d’un couteau à canneler (appelé aussi canneleur) sur la surface de certains fruits & légumes (oranges, citrons, carottes…) pour améliorer leur présentation."]
[null,null,null,null,null,null,null,null,null,null,null,{"$f":"LARGE(L5:L28,1)+1","v":23},"Concasser",{"$f":"LARGE(N5:N28,1)+1","v":69},"Etuver",{"$f":"LARGE(P5:P28,1)+1","v":111},"Nacrer",{"$f":"LARGE(R5:R28,1)+1","v":152},"Tronçonner",null,null,null,null,{"$f":"LARGE(X5:X28,1)+1","v":80},"Disperser",{"$f":"LARGE(Z5:Z28,1)+1","v":135},"Garnir",null,"N",{"$f":"LARGE(AD5:AD28,1)+1","v":241},"Retomber",{"$f":"LARGE(AF5:AF28,1)+1","v":288},"Videler",{"$f":"LARGE(AH4:AH28,1)+1","v":26},"conduire",null,{"$f":"LARGE(AK4:AK28,1)+1","v":82},"présenter",null,null,null,"Caramélisation : phénomène correspondant au changement de couleur consécutif à une dégradation du saccharose au contact d’une source de chaleur importante. C’est une réaction de brunissement non enzymatique."]
[null,null,null,null,null,null,null,null,null,null,null,{"$f":"LARGE(L5:L29,1)+1","v":24},"Confire",{"$f":"LARGE(N5:N29,1)+1","v":70},"Evider",{"$f":"LARGE(P5:P29,1)+1","v":112},"Napper",{"$f":"LARGE(R5:R29,1)+1","v":153},"Trousser",null,null,null,"C",{"$f":"LARGE(X5:X29,1)+1","v":81},"Disposer",{"$f":"LARGE(Z5:Z29,1)+1","v":136},"Gerber",{"$f":"LARGE(AB5:AB29,1)+1","v":187},"Nacrer",{"$f":"LARGE(AD5:AD29,1)+1","v":242},"Retourner",{"$f":"LARGE(AF5:AF29,1)+1","v":289},"Voiler",{"$f":"LARGE(AH4:AH29,1)+1","v":27},"consigner",null,{"$f":"LARGE(AK4:AK29,1)+1","v":83},"prévoir",null,null,null,"Caraméliser : enduire un moule ou une pâtisserie de sucre cuit au caramel.",null,null,null,null,null,"❸","Préparer la purée"]
[null,null,null,null,null,null,null,null,null,null,null,{"$f":"LARGE(L5:L30,1)+1","v":25},"Contiser",{"$f":"LARGE(N5:N30,1)+1","v":71},"Exprimer",null,null,{"$f":"LARGE(R5:R30,1)+1","v":154},"Turbiner",null,null,{"$f":"LARGE(V5:V30,1)+1","v":24},"Candir ",{"$f":"LARGE(X5:X30,1)+1","v":82},"Dorer",{"$f":"LARGE(Z5:Z30,1)+1","v":137},"Glacer",{"$f":"LARGE(AB5:AB30,1)+1","v":188},"Napper",{"$f":"LARGE(AD5:AD30,1)+1","v":243},"Revenir",null,null,{"$f":"LARGE(AH4:AH30,1)+1","v":28},"constituer",null,{"$f":"LARGE(AK4:AK30,1)+1","v":84},"produire",null,null,null,"Chablonner : appliquer du chocolat de couverture ou de la pâte à glacer à la base des entremets, petits gâteaux, des ganaches, pour faciliter leur manipulation avant leur montage ou découpage.",null,"Lien >","Lexique en français de la boucherie Wiktionnaire",null,null,1," Préparer la purée déshydratée en suivant les indications du fabricant."]
[null,null,null,null,null,null,null,null,null,null,null,{"$f":"LARGE(L5:L31,1)+1","v":26},"Corner",null,"F",null,"P",null,null,null,null,{"$f":"LARGE(V5:V31,1)+1","v":25},"Canneler",{"$f":"LARGE(X5:X31,1)+1","v":83},"Doubler",{"$f":"LARGE(Z5:Z31,1)+1","v":138},"Gommer",null,"P",{"$f":"LARGE(AD5:AD31,1)+1","v":244},"Rincer",null,"Z",{"$f":"LARGE(AH4:AH31,1)+1","v":29},"construire",null,{"$f":"LARGE(AK4:AK31,1)+1","v":85},"programmer",null,null,null,"Chemiser : appliquer contre la paroi intérieur d’un moule ou d’une caissette, une couche de pâte, de biscuit, de gelée, de chocolat, de glace, de farine etc…"]
[null,null,null,null,null,null,null,null,null,null,null,{"$f":"LARGE(L5:L32,1)+1","v":27},"Corser",{"$f":"LARGE(N5:N32,1)+1","v":72},"Farcir",{"$f":"LARGE(P5:P32,1)+1","v":113},"Paner",null,"V",null,null,{"$f":"LARGE(V5:V32,1)+1","v":26},"Caraméliser",{"$f":"LARGE(X5:X32,1)+1","v":84},"Dresser",{"$f":"LARGE(Z5:Z32,1)+1","v":139},"Grainer",{"$f":"LARGE(AB5:AB32,1)+1","v":189},"Panacher",{"$f":"LARGE(AD5:AD32,1)+1","v":245},"Rioler",{"$f":"LARGE(AF5:AF32,1)+1","v":290},"Zester",{"$f":"LARGE(AH4:AH32,1)+1","v":30},"contrôler",null,{"$f":"LARGE(AK4:AK32,1)+1","v":86},"rebâtir",null,null,null,"Chiqueter : tailler le tour d’une pièce de feuilletage avant la cuisson avec la lame d’un couteau pour lui donner un aspect particulier.",null,"Lien >","Lexique en français de la cuisine Wiktionnaire",null,null,2,"Mettre au point l'assaisonnement. "]
[null,null,null,null,null,null,null,null,null,null,null,{"$f":"LARGE(L5:L33,1)+1","v":28},"Coucher",{"$f":"LARGE(N5:N33,1)+1","v":73},"Festonner",{"$f":"LARGE(P5:P33,1)+1","v":114},"Papilloter",{"$f":"LARGE(R5:R33,1)+1","v":155},"Vanner",null,null,{"$f":"LARGE(V5:V33,1)+1","v":27},"Caraméliser",null,null,{"$f":"LARGE(Z5:Z33,1)+1","v":140},"Graisser",{"$f":"LARGE(AB5:AB33,1)+1","v":190},"Paner",{"$f":"LARGE(AD5:AD33,1)+1","v":246},"Rissoler",null,null,{"$f":"LARGE(AH4:AH33,1)+1","v":31},"couper",null,{"$f":"LARGE(AK4:AK33,1)+1","v":87},"réceptionner",null,null,null,"Confire : remplacer l’eau de végétation des fruits par un sirop à la suite d’immersions multiples et répétées dans un sirop de sucre de plus en plus concentré.",null,null,null,null,null,3,"Muscader légèrement."]
[null,null,null,null,null,null,null,null,null,null,null,{"$f":"LARGE(L5:L34,1)+1","v":29},"Coucher",{"$f":"LARGE(N5:N34,1)+1","v":74},"Flamber",{"$f":"LARGE(P5:P34,1)+1","v":115},"Passer",{"$f":"LARGE(R5:R34,1)+1","v":156},"Videler",null,null,{"$f":"LARGE(V5:V34,1)+1","v":28},"Cerner",null,"E",{"$f":"LARGE(Z5:Z34,1)+1","v":141},"Gratiner",{"$f":"LARGE(AB5:AB34,1)+1","v":191},"Papilloter",{"$f":"LARGE(AD5:AD34,1)+1","v":247},"Rompre",null,null,{"$f":"LARGE(AH4:AH34,1)+1","v":32},"créer",null,{"$f":"LARGE(AK4:AK34,1)+1","v":88},"reconstruire",null,null,null,"Corner : utiliser une corne à l’intérieur d’un  récipient pour récupérer le maximum d’appareil.",null,"Lien >","Spécificités et usages du vocabulaire des \"métiers de la bouche\" ",null,null,4,"Réserver au chaud."]
[null,null,null,null,null,null,null,null,null,null,null,{"$f":"LARGE(L5:L35,1)+1","v":30},"Crémer",{"$f":"LARGE(N5:N35,1)+1","v":75},"Flanquer",{"$f":"LARGE(P5:P35,1)+1","v":116},"Persiller",{"$f":"LARGE(R5:R35,1)+1","v":157},"Voiler",null,null,{"$f":"LARGE(V5:V35,1)+1","v":29},"Chablonner",{"$f":"LARGE(X5:X35,1)+1","v":85},"Ebarber",{"$f":"LARGE(Z5:Z35,1)+1","v":142},"Griller",{"$f":"LARGE(AB5:AB35,1)+1","v":192},"Parer",{"$f":"LARGE(AD5:AD35,1)+1","v":248},"Rôtir",null,null,{"$f":"LARGE(AH4:AH35,1)+1","v":33},"creuser",null,{"$f":"LARGE(AK4:AK35,1)+1","v":89},"réduire",null,null,null,"Corps : terme appliqué à une pâte pour désigner son élasticité, sa résistance après son pétrissage, résultant de la formation de gluten.",null,null,null,null,null,null,"Ou marquer la cuisson des pommes de terre pour la réalisation de la purée fraîche."]
[null,null,null,null,null,null,null,null,null,null,null,{"$f":"LARGE(L5:L36,1)+1","v":31},"Crever",{"$f":"LARGE(N5:N36,1)+1","v":76},"Fleurer",{"$f":"LARGE(P5:P36,1)+1","v":117},"Piler",null,null,null,null,{"$f":"LARGE(V5:V36,1)+1","v":30},"Châtrer",{"$f":"LARGE(X5:X36,1)+1","v":86},"Ebaucher",{"$f":"LARGE(Z5:Z36,1)+1","v":143},"H",{"$f":"LARGE(AB5:AB36,1)+1","v":193},"Parfumer",{"$f":"LARGE(AD5:AD36,1)+1","v":249},"Rouler",null,null,{"$f":"LARGE(AH4:AH36,1)+1","v":34},"cultiver",null,{"$f":"LARGE(AK4:AK36,1)+1","v":90},"régler",null,null,null,"Corser : donner de l’élasticité à une pâte  en la pétrissant davantage."]
[null,null,null,null,null,null,null,null,null,null,null,{"$f":"LARGE(L5:L37,1)+1","v":32},"Cuire",{"$f":"LARGE(N5:N37,1)+1","v":77},"Foisonner",{"$f":"LARGE(P5:P37,1)+1","v":118},"Pincer",null,"Z",null,null,{"$f":"LARGE(V5:V37,1)+1","v":31},"Chauffer",{"$f":"LARGE(X5:X37,1)+1","v":87},"Ecailler",{"$f":"LARGE(Z5:Z37,1)+1","v":144},"Habiller",{"$f":"LARGE(AB5:AB37,1)+1","v":194},"Parsemer",{"$f":"LARGE(AD5:AD37,1)+1","v":250},"Roussir",null,null,{"$f":"LARGE(AH4:AH37,1)+1","v":35},"décentraliser",null,{"$f":"LARGE(AK4:AK37,1)+1","v":91},"réguler",null,null,null,"Coucher (synonyme de dresser) : façonner à la poche à douille généralement sur plaque ou tapis anti-adhérant, papier sulfurisé des appareils mous (pâte à choux, biscuits, meringues).",null,null,"Quelques expressions"]
[null,null,null,null,null,null,null,null,null,null,null,null,"D",{"$f":"LARGE(N5:N38,1)+1","v":78},"Foncer",{"$f":"LARGE(P5:P38,1)+1","v":119},"Piquer",{"$f":"LARGE(R5:R38,1)+1","v":158},"Zester",null,null,{"$f":"LARGE(V5:V38,1)+1","v":32},"Chaufroiter",{"$f":"LARGE(X5:X38,1)+1","v":88},"Ecaler",{"$f":"LARGE(Z5:Z38,1)+1","v":145},"Hacher",{"$f":"LARGE(AB5:AB38,1)+1","v":195},"Passer",null,null,null,null,{"$f":"LARGE(AH4:AH38,1)+1","v":36},"décharger",null,{"$f":"LARGE(AK4:AK38,1)+1","v":92},"remodeler",null,null,null,"Crémer : travailler une matière grasse seule ou avec du sucre, afin de lui donner la consistance d’une crème.",null,null,null,null,null,"❹","Confectionner la brandade de morue"]
[null,null,null,null,null,null,null,null,null,null,null,{"$f":"LARGE(L5:L39,1)+1","v":33},"Décanter",{"$f":"LARGE(N5:N39,1)+1","v":79},"Fondre",{"$f":"LARGE(P5:P39,1)+1","v":120},"Pocher",null,null,null,null,{"$f":"LARGE(V5:V39,1)+1","v":33},"Chemiser",{"$f":"LARGE(X5:X39,1)+1","v":89},"Echauder",{"$f":"LARGE(Z5:Z39,1)+1","v":146},"Historier",{"$f":"LARGE(AB5:AB39,1)+1","v":196},"Pasteuriser",null,"S",null,null,{"$f":"LARGE(AH4:AH39,1)+1","v":37},"dessiner",null,{"$f":"LARGE(AK4:AK39,1)+1","v":93},"remplacer",null,null,null,"Crouter : opération permettant de sécher à l’air ou en étuve une fabrication crue ou cuite afin d’obtenir une pellicule sèche et résistante à sa surface (biscuit cuillère, macarons…).",null,1,"désinfecter le matériel",null,null,1," Préchauffer le four sur la position vapeur"]
[null,null,null,null,null,null,null,null,null,null,null,{"$f":"LARGE(L5:L40,1)+1","v":34},"Décercler",{"$f":"LARGE(N5:N40,1)+1","v":80},"Fouler",{"$f":"LARGE(P5:P40,1)+1","v":121},"Poêler",null,null,null,null,{"$f":"LARGE(V5:V40,1)+1","v":34},"Chevaucher",{"$f":"LARGE(X5:X40,1)+1","v":90},"Ecorcher",{"$f":"LARGE(Z5:Z40,1)+1","v":147},"Huiler",{"$f":"LARGE(AB5:AB40,1)+1","v":197},"Peler",{"$f":"LARGE(AD5:AD40,1)+1","v":251},"Sabler",null,null,{"$f":"LARGE(AH4:AH40,1)+1","v":38},"documenter",null,{"$f":"LARGE(AK4:AK40,1)+1","v":94},"rénover",null,null,null,"D",null,2,"désinfecter le poste de travail",null,null,2,"Cuire les filets à la vapeur 7 minutes environ"]
[null,null,null,null,null,null,null,null,null,null,null,{"$f":"LARGE(L5:L41,1)+1","v":35},"Décortiquer",{"$f":"LARGE(N5:N41,1)+1","v":81},"Fraiser",{"$f":"LARGE(P5:P41,1)+1","v":122},"Pousser",null,null,null,null,{"$f":"LARGE(V5:V41,1)+1","v":35},"Chiqueter",{"$f":"LARGE(X5:X41,1)+1","v":91},"Ecosser",null,null,{"$f":"LARGE(AB5:AB41,1)+1","v":198},"Persiller",{"$f":"LARGE(AD5:AD41,1)+1","v":252},"Saigner",null,null,{"$f":"LARGE(AH4:AH41,1)+1","v":39},"écouler",null,{"$f":"LARGE(AK4:AK41,1)+1","v":95},"réorganiser",null,null,null,"Décercler : retirer avec précaution le cercle d’un fond de tarte ou d’un entremet.",null,3,"etager les bacs sur l'échelle de cuisson",null,null,null,"Ne pas trop cuire au risque de retirer les propriétés gluantes de la morue"]
[null,null,null,null,null,null,null,null,null,null,null,{"$f":"LARGE(L5:L42,1)+1","v":36},"Décuire",{"$f":"LARGE(N5:N42,1)+1","v":82},"Fileter",{"$f":"LARGE(P5:P42,1)+1","v":123},"Puncher",null,null,null,null,{"$f":"LARGE(V5:V42,1)+1","v":36},"Ciseler",{"$f":"LARGE(X5:X42,1)+1","v":92},"Ecumer",null,"I",{"$f":"LARGE(AB5:AB42,1)+1","v":199},"Peser",{"$f":"LARGE(AD5:AD42,1)+1","v":253},"Saisir",null,null,{"$f":"LARGE(AH4:AH42,1)+1","v":40},"écrire",null,{"$f":"LARGE(AK4:AK42,1)+1","v":96},"réparer",null,null,null,"Décoction : solution obtenue par l’action prolongée de l’eau bouillante sur une plante aromatique.",null,4,"selectionner le matériel"]
[null,null,null,null,null,null,null,null,null,null,null,{"$f":"LARGE(L5:L43,1)+1","v":37},"Déffilandrer",{"$f":"LARGE(N5:N43,1)+1","v":83},"Frapper",null,"Q",null,null,null,null,{"$f":"LARGE(V5:V43,1)+1","v":37},"Citronner",{"$f":"LARGE(X5:X43,1)+1","v":93},"Effilandrer",{"$f":"LARGE(Z5:Z43,1)+1","v":148},"Imbiber",{"$f":"LARGE(AB5:AB43,1)+1","v":200},"Pétrir",{"$f":"LARGE(AD5:AD43,1)+1","v":254},"Sangler",null,null,{"$f":"LARGE(AH4:AH43,1)+1","v":41},"édifier",null,{"$f":"LARGE(AK4:AK43,1)+1","v":97},"résoudre",null,null,null,"Dessécher : déshydrater, faire évaporer l’excédent d’eau se trouvant dans une préparation en la chauffant sur feu doux dans une étuve ou dans un four (ex : pâte à choux)",null,5,"suivre les protocoles",null,null,3,"Effeuiller les filets de morue cuits."]
[null,null,null,null,null,null,null,null,null,null,null,{"$f":"LARGE(L5:L44,1)+1","v":38},"Déglacer",{"$f":"LARGE(N5:N44,1)+1","v":84},"Frémir",{"$f":"LARGE(P5:P44,1)+1","v":124},"Quadriller",null,null,null,null,{"$f":"LARGE(V5:V44,1)+1","v":38},"Clarifier",{"$f":"LARGE(X5:X44,1)+1","v":94},"Effiler",{"$f":"LARGE(Z5:Z44,1)+1","v":149},"Inciser",{"$f":"LARGE(AB5:AB44,1)+1","v":201},"Piler",{"$f":"LARGE(AD5:AD44,1)+1","v":255},"Saumurer",null,null,{"$f":"LARGE(AH4:AH44,1)+1","v":42},"effectuer",null,{"$f":"LARGE(AK4:AK44,1)+1","v":98},"réviser",null,null,null,"Détailler : découper des morceaux de pâte de forme bien déterminée dans une abaisse de pâte, à l’aide d’un couteau ou d’un découpoir.",null,null,null,null,null,4,"Dans une sauteuse, faire chauffer l'huile d'olive"]
[null,null,null,null,null,null,null,null,null,null,null,{"$f":"LARGE(L5:L45,1)+1","v":39},"Dégorger",{"$f":"LARGE(N5:N45,1)+1","v":85},"Frire",null,null,null,null,null,null,{"$f":"LARGE(V5:V45,1)+1","v":39},"Clouter",{"$f":"LARGE(X5:X45,1)+1","v":95},"Egermer",{"$f":"LARGE(Z5:Z45,1)+1","v":150},"Incorporer",{"$f":"LARGE(AB5:AB45,1)+1","v":202},"Pincer",{"$f":"LARGE(AD5:AD45,1)+1","v":256},"Saupoudrer",null,null,{"$f":"LARGE(AH4:AH45,1)+1","v":43},"élaborer",null,{"$f":"LARGE(AK4:AK45,1)+1","v":99},"revoir",null,null,null,"Détrempe : mélange de farine, d’eau et de sel servant de base à la pâte feuilleté et à la pâte levée feuilleté.",null,null,null,null,null,5,"ajouter la morue effeuillée et l'ail"]
[null,null,null,null,null,null,null,null,null,null,null,{"$f":"LARGE(L5:L46,1)+1","v":40},"Dégourdir",null,"G",null,"R",null,null,null,null,{"$f":"LARGE(V5:V46,1)+1","v":40},"Coller",{"$f":"LARGE(X5:X46,1)+1","v":96},"Egoutter",{"$f":"LARGE(Z5:Z46,1)+1","v":151},"Indications packaging",{"$f":"LARGE(AB5:AB46,1)+1","v":203},"Piquer",{"$f":"LARGE(AD5:AD46,1)+1","v":257},"Sauter",null,null,{"$f":"LARGE(AH4:AH46,1)+1","v":44},"emplir",null,{"$f":"LARGE(AK4:AK46,1)+1","v":100},"sensibiliser",null,null,null,"E",null,1,"eplucher-laver-désinfecter",null,null,6,"travailler à la spatule"]
[null,null,null,null,null,null,null,null,null,null,null,{"$f":"LARGE(L5:L47,1)+1","v":41},"Dégraisser",{"$f":"LARGE(N5:N47,1)+1","v":86},"Glacer",{"$f":"LARGE(P5:P47,1)+1","v":125},"Rabattre",null,null,null,null,{"$f":"LARGE(V5:V47,1)+1","v":41},"Compoter",{"$f":"LARGE(X5:X47,1)+1","v":97},"Egrapper",{"$f":"LARGE(Z5:Z47,1)+1","v":152},"Infuser",{"$f":"LARGE(AB5:AB47,1)+1","v":204},"Plaquer",{"$f":"LARGE(AD5:AD47,1)+1","v":258},"Serrer",null,null,{"$f":"LARGE(AH4:AH47,1)+1","v":45},"employer",null,{"$f":"LARGE(AK4:AK47,1)+1","v":101},"simplifier",null,null,null,"Écumer : c’est éliminer les impuretés qui se forment à la surface de cuisson de sucre, confitures, gelées à l’aide d’une écumoire.",null,2,"faire tremper",null,null,null,"(ou travailler directement la morue effeuillée dans la cuve du batteur)."]
[null,null,null,null,null,null,null,null,null,null,null,{"$f":"LARGE(L5:L48,1)+1","v":42},"Déhousser",{"$f":"LARGE(N5:N48,1)+1","v":87},"Gommer",{"$f":"LARGE(P5:P48,1)+1","v":126},"Rafraîchir",null,null,null,null,{"$f":"LARGE(V5:V48,1)+1","v":42},"Concasser",{"$f":"LARGE(X5:X48,1)+1","v":98},"Egrener",null,null,{"$f":"LARGE(AB5:AB48,1)+1","v":205},"Pocher",{"$f":"LARGE(AD5:AD48,1)+1","v":259},"Servir",null,null,{"$f":"LARGE(AH4:AH48,1)+1","v":46},"enregistrer",null,{"$f":"LARGE(AK4:AK48,1)+1","v":102},"soulever",null,null,null,"Émonder : retirer les peaux, pellicules et enveloppe de certains fruits ou légumes.",null,3,"habiller les soles"]
[null,null,null,null,null,null,null,null,null,null,null,{"$f":"LARGE(L5:L49,1)+1","v":43},"Dénerver",{"$f":"LARGE(N5:N49,1)+1","v":88},"Graisser",{"$f":"LARGE(P5:P49,1)+1","v":127},"Raidir",null,null,null,null,{"$f":"LARGE(V5:V49,1)+1","v":43},"Confire",{"$f":"LARGE(X5:X49,1)+1","v":99},"Eliminer",null,"J",{"$f":"LARGE(AB5:AB49,1)+1","v":206},"Poêler",{"$f":"LARGE(AD5:AD49,1)+1","v":260},"Singer",null,null,{"$f":"LARGE(AH4:AH49,1)+1","v":47},"entretenir",null,{"$f":"LARGE(AK4:AK49,1)+1","v":103},"standardiser",null,null,null,"Émulsionner : opération consistant à provoquer la dispersion d’un liquide dans un autre liquide ou d’une matière non miscible (ex : ganache).",null,4,"hacher finement",null,null,7,"Mettre la morue travaillée dans la grande cuve du batteur"]
[null,null,null,null,null,null,null,null,null,null,null,{"$f":"LARGE(L5:L50,1)+1","v":44},"Dénoyauter",{"$f":"LARGE(N5:N50,1)+1","v":89},"Gratiner",{"$f":"LARGE(P5:P50,1)+1","v":128},"Rassir",null,null,null,null,{"$f":"LARGE(V5:V50,1)+1","v":44},"Conserver",{"$f":"LARGE(X5:X50,1)+1","v":100},"Emonder",{"$f":"LARGE(Z5:Z50,1)+1","v":153},"Jeter",{"$f":"LARGE(AB5:AB50,1)+1","v":207},"Porter à ébullition",{"$f":"LARGE(AD5:AD50,1)+1","v":261},"Siroper",null,null,{"$f":"LARGE(AH4:AH50,1)+1","v":48},"envoyer",null,{"$f":"LARGE(AK4:AK50,1)+1","v":104},"superviser",null,null,null,"Évider : éliminer, extraire l’intérieur de certains fruits (ex : citrons, orange).",null,5,"laver à grande eau"]
[null,null,null,null,null,null,null,null,null,null,null,{"$f":"LARGE(L5:L51,1)+1","v":45},"Denteler",{"$f":"LARGE(N5:N51,1)+1","v":90},"Griller",{"$f":"LARGE(P5:P51,1)+1","v":129},"Rayer",null,null,null,null,{"$f":"LARGE(V5:V51,1)+1","v":45},"Contiser",{"$f":"LARGE(X5:X51,1)+1","v":101},"Émulsionner",null,null,{"$f":"LARGE(AB5:AB51,1)+1","v":208},"Poudrer",{"$f":"LARGE(AD5:AD51,1)+1","v":262},"Siroter",null,null,{"$f":"LARGE(AH4:AH51,1)+1","v":49},"ériger",null,{"$f":"LARGE(AK4:AK51,1)+1","v":105},"surveiller",null,null,null,"F",null,6,"peser les denrées",null,null,8,"A la feuille en première vitesse, incorporer progressivement le lait et la crème"]
[null,null,null,null,null,null,null,null,null,null,null,null,null,null,null,null,null,null,null,null,null,{"$f":"LARGE(V5:V52,1)+1","v":46},"Contrôler",{"$f":"LARGE(X5:X52,1)+1","v":102},"Enfourner",null,"L",{"$f":"LARGE(AB5:AB52,1)+1","v":209},"Pousser",{"$f":"LARGE(AD5:AD52,1)+1","v":263},"Snacker",null,null,{"$f":"LARGE(AH4:AH52,1)+1","v":50},"établir",null,{"$f":"LARGE(AK4:AK52,1)+1","v":106},"tester",null,null,null,"Façonner : c’est donner une forme  particulière à toute sortes de pâtes par un travail manuel ou mécanique avant cuisson.",null,7,"trier et tremper"]
[null,null,null,null,null,null,null,null,null,null,null,null,null,null,null,null,null,null,null,null,null,{"$f":"LARGE(V5:V53,1)+1","v":47},"Corner",{"$f":"LARGE(X5:X53,1)+1","v":103},"Enrober",{"$f":"LARGE(Z5:Z53,1)+1","v":154},"Larder",{"$f":"LARGE(AB5:AB53,1)+1","v":210},"Praliner",{"$f":"LARGE(AD5:AD53,1)+1","v":264},"Sonder",null,null,{"$f":"LARGE(AH4:AH53,1)+1","v":51},"étendre",null,{"$f":"LARGE(AK4:AK53,1)+1","v":107},"transformer",null,null,null,"Festonner : constituer des bordures décoratives ou des formes arrondies sur des pâtisseries (ex : pithiviers, tartelette…).",null,8,"vérifier les DLC",null,null,null,"Éventuellement, mettre au point la consistance en ajoutant du lait, de l'huile d'oli­ve ou de la crème"]
[null,null,null,null,null,null,null,null,null,null,null,null,null,null,null,null,null,null,null,null,null,{"$f":"LARGE(V5:V54,1)+1","v":48},"Corser",{"$f":"LARGE(X5:X54,1)+1","v":104},"Eplucher",{"$f":"LARGE(Z5:Z54,1)+1","v":155},"Laver",{"$f":"LARGE(AB5:AB54,1)+1","v":211},"Préchauffer",{"$f":"LARGE(AD5:AD54,1)+1","v":265},"Stériliser",null,null,{"$f":"LARGE(AH4:AH54,1)+1","v":52},"examiner",null,{"$f":"LARGE(AK4:AK54,1)+1","v":108},"trier",null,null,null,"Fleurer : saupoudrer de farine un tour, une plaque ou un moule afin d’empêcher certaines préparations de coller."]
[null,null,null,null,null,null,null,null,null,null,null,null,null,null,null,null,null,null,null,null,null,{"$f":"LARGE(V5:V55,1)+1","v":49},"Coucher",{"$f":"LARGE(X5:X55,1)+1","v":105},"Equeter",{"$f":"LARGE(Z5:Z55,1)+1","v":156},"Lever",{"$f":"LARGE(AB5:AB55,1)+1","v":212},"Prélever",{"$f":"LARGE(AD5:AD55,1)+1","v":266},"Suer",null,null,{"$f":"LARGE(AH4:AH55,1)+1","v":53},"exécuter",null,{"$f":"LARGE(AK4:AK55,1)+1","v":109},"utiliser",null,null,null,"Foncer : tapisser l’intérieur d’un moule ou d’un cercle avec de la pâte, pour qu’elle épouse parfaitement sa forme.",null,1,"ciseler finement",null,null,null,"On doit obtenir une pâte homogène et compacte"]
[null,null,null,null,null,null,null,null,null,null,null,null,null,null,null,null,null,null,null,null,null,{"$f":"LARGE(V5:V56,1)+1","v":50},"Craquer",{"$f":"LARGE(X5:X56,1)+1","v":106},"Escaloper",{"$f":"LARGE(Z5:Z56,1)+1","v":157},"Lier",{"$f":"LARGE(AB5:AB56,1)+1","v":213},"Préparer",{"$f":"LARGE(AD5:AD56,1)+1","v":267},"Surgeler",null,null,{"$f":"LARGE(AH4:AH56,1)+1","v":54},"exploiter",null,{"$f":"LARGE(AK4:AK56,1)+1","v":110},"vaporiser",null,null,null,"Fond : pâtisseries utilisée comme base de fabrication et constituant généralement la couche inférieure des gâteaux.",null,2,"couper en 2",null,null,9,"Poivrer et muscader"]
[null,null,null,null,null,null,null,null,null,null,null,null,null,null,null,null,null,null,null,null,null,{"$f":"LARGE(V5:V57,1)+1","v":51},"Crémer",{"$f":"LARGE(X5:X57,1)+1","v":107},"Etaler",{"$f":"LARGE(Z5:Z57,1)+1","v":158},"Limoner",{"$f":"LARGE(AB5:AB57,1)+1","v":214},"Protéger",null,null,null,null,{"$f":"LARGE(AH4:AH57,1)+1","v":55},"extraire",null,{"$f":"LARGE(AK4:AK57,1)+1","v":111},"vérifier",null,null,null,"Foisonnement: phénomène résultant d’une augmentation de volume d’une fabrication par incorporation de gaz.",null,null,null,null,null,10," Finir de lier la brandade en ajoutant la purée."]
[null,null,null,null,null,null,null,null,null,null,null,null,null,null,null,null,null,null,null,null,null,{"$f":"LARGE(V5:V58,1)+1","v":52},"Crever",{"$f":"LARGE(X5:X58,1)+1","v":108},"Etoffer",{"$f":"LARGE(Z5:Z58,1)+1","v":159},"Lisser",{"$f":"LARGE(AB5:AB58,1)+1","v":215},"Puncher",null,null,null,null,{"$f":"LARGE(AH4:AH58,1)+1","v":56},"faire",null,null,null,null,null,null,"Fraser : écraser les ingrédients d’une pâte pour les agglomérer soit sur le marbre avec la paume de la main en la poussant devant soi, soit au batteur en écrasant avec la paume de sa main sur les parois.",null,null,null,null,null,11," Travailler"]
[null,null,null,null,null,null,null,null,null,null,null,null,null,null,null,null,null,null,null,null,null,{"$f":"LARGE(V5:V59,1)+1","v":53},"Crouter",{"$f":"LARGE(X5:X59,1)+1","v":109},"Etouffer",{"$f":"LARGE(Z5:Z59,1)+1","v":160},"Lustrer",null,null,null,null,null,null,null,null,null,null,null,null,null,null,"G",null,1,"adjoindre de la creme",null,null,12," Rectifier la consistance"]
[null,null,null,null,null,null,null,null,null,null,null,null,null,null,null,null,null,null,null,null,null,{"$f":"LARGE(V5:V60,1)+1","v":54},"Cuire",{"$f":"LARGE(X5:X60,1)+1","v":110},"Etuver",{"$f":"LARGE(Z5:Z60,1)+1","v":161},"Luter",null,"Q",null,null,null,null,null,null,null,null,null,null,null,null,"Garnir : remplir avec une préparation de crème ou autres un fond de gâteau, un moule, une poche.",null,2,"ajouter dans l'ordre les autres éléments"]
[null,null,null,null,null,null,null,null,null,null,null,null,null,null,null,null,null,null,null,null,null,{"$f":"LARGE(V5:V61,1)+1","v":55},"Culotter",{"$f":"LARGE(X5:X61,1)+1","v":111},"Evider",{"$f":"LARGE(Z5:Z61,1)+1","v":162},"Lyophiliser",{"$f":"LARGE(AB5:AB61,1)+1","v":216},"Quadriller",null,null,null,null,null,null,null,null,null,null,null,null,"Glacer :",null,3,"arroser de beurre noisette",null,null,"❺","Décanter la préparation"]
[null,null,null,null,null,null,null,null,null,null,null,null,null,null,null,null,null,null,null,null,null,null,null,{"$f":"LARGE(X5:X62,1)+1","v":112},"Exprimer",null,null,null,null,null,null,null,null,null,null,null,null,null,null,null,null,"– action de recouvrir partiellement ou entièrement la surface d’une pâtisserie avec un glaçage (ex : fondant)",null,4,"arroser de liqueur ",null,null,1,"Dans les 8 bacs GN 1/1 beurrés, répartir la brandade Bénédictine"]
[null,null,null,null,null,null,null,null,null,null,null,null,null,null,null,null,null,null,null,null,null,null,null,null,null,null,null,null,null,null,null,null,null,null,null,null,null,null,null,null,null,"– rendre brillant la surface d’une pâtisserie avec du sirop avant le passage au four ou saupoudrer une pièce de sucre glace et la passer au four, le temps de caraméliser le sucre.",null,5,"beurrer grassement"]
[null,null,null,null,null,null,null,null,null,null,null,null,null,null,null,null,null,null,null,null,null,null,null,null,null,null,null,null,null,null,null,null,null,null,null,null,null,null,null,null,null,"Grainage : phénomène résultant de la déstabilisation d’une mousse alimentaire (ex : blancs montés) ou d’une émulsion mousseuse (ex : crème fouettée) à la suite d’un battage prolongé.",null,6,"blanchir-rafraichir-couper",null,null,2,"Égaliser la surface "]
[null,null,null,null,null,null,null,null,null,null,null,null,null,null,null,null,null,null,null,null,null,null,"Lien >","Lexique en français de la boucherie",null,null,null,null,null,null,null,null,null,null,null,null,null,null,null,null,null,"Graisser : enduire d’une couche de matière grasse à l’aide d’un pinceau ou d’une bombe à graisse les parois d’un moule ou une plaque.",null,7,"crémer-réduire",null,null,3,"Saupoudrer d'emmenthal râpé"]
[null,null,null,null,null,null,null,null,null,null,null,null,null,null,null,null,null,null,null,null,null,null,"Lien >","Le dictionnaire du boucher",null,null,null,null,null,null,null,null,null,null,null,null,null,null,null,null,null,"I",null,8,"passer la sauce",null,null,4,"Parsemer de parcelles de beurre"]
[null,null,null,null,null,null,null,null,null,null,null,null,null,null,null,null,null,null,null,null,null,null,"Verbes d'action Lien >","https://www.unamur.be/services/sevrexe/prodoc/documents-mission-accompagnement-prodoc-AL/verbes-actions",null,null,null,null,null,null,null,null,null,null,null,null,null,null,null,null,null,"Imbiber : c’est faire pénétrer un liquide (sirop, alcool, liqueur etc…) dans une préparation dans le but de la rendre moins sèche ou dans le but de la parfumer.",null,9,"reviser l'assaisonnement",null,null,5,"Étager les bacs sur l'échelle de cuisson"]
[null,null,null,null,null,null,null,null,null,null,null,null,null,null,null,null,null,null,null,null,null,null,null,null,null,null,null,null,null,null,null,null,null,null,null,null,null,null,null,null,null,"Infuser : opération consistant à placer une substance aromatique dans un liquide chauffé au préalable, pendant un temps déterminé et à couvert pour capter son arôme.",null,10,"saler en cours de cuisson"]
[null,null,null,null,null,null,null,null,null,null,null,null,null,null,null,null,null,null,null,null,null,null,null,null,null,null,null,null,null,null,null,null,null,null,null,null,null,null,null,null,null,"L",null,11,"saupoudrer légèrement",null,null,"❻","Gratiner"]
[null,null,null,null,null,null,null,null,null,null,null,null,null,null,null,null,null,null,null,null,null,null,null,null,null,null,null,null,null,null,null,null,null,null,null,null,null,null,null,null,null,"Lisser : mélanger une préparation pour la rendre homogène.",null,12,"vérifier la consistance",null,null,1," Passer au four en chaleur sèche à + 170 °C"]
[null,null,null,null,null,null,null,null,null,null,null,null,null,null,null,null,null,null,null,null,null,null,null,null,null,null,null,null,null,null,null,null,null,null,null,null,null,null,null,null,null,"Lustrer : recouvrir de nappage de gelée ou de beurre fondu, une préparation afin de lui donner un aspect brillant.",null,null,null,null,null,2," et gratiner légèrement la surface"]
[null,null,null,null,null,null,null,null,null,null,null,null,null,null,null,null,null,null,null,null,null,null,null,null,null,null,null,null,null,null,null,null,null,null,null,null,null,null,null,null,null,"M",null,null,null,null,null,3,"Respecter la procédure de fin de cuisson"]
[null,null,null,null,null,null,null,null,null,null,null,null,null,null,null,null,null,null,null,null,null,null,null,null,null,null,null,null,null,null,null,null,null,null,null,null,null,null,null,null,null,"Macérer : opération consistant à faire tremper un corps dans un liquide froid pour en extraire les parties solubles ou un produit alimentaire pour le parfumer ou le conserver.",null,1,"déglacer au vin blanc",null,null,4,"Stocker en armoire chaude et maintenir à + 63 °C, en attente de consommation."]
[null,null,null,null,null,null,null,null,null,null,null,null,null,null,null,null,null,null,null,null,null,null,null,null,null,null,null,null,null,null,null,null,null,null,null,null,null,null,null,null,null,"Marbrer : réaliser divers dessins sur des gâteaux glacés (au fondant, au nappage etc …) pour améliorer leur présentation.",null,2,"dégraisser en partie"]
[null,null,null,null,null,null,null,null,null,null,null,null,null,null,null,null,null,null,null,null,null,null,null,null,null,null,null,null,null,null,null,null,null,null,null,null,null,null,null,null,null,"Masquer : recouvrir un entremets ou un fond de plat d’une légère couche de crème, de sauce ou de gelée.",null,3,"égoutter et débarrasser"]
[null,null,null,null,null,null,null,null,null,null,null,null,null,null,null,null,null,null,null,null,null,null,null,null,null,null,null,null,null,null,null,null,null,null,null,null,null,null,null,null,null,"Monter :",null,4,"étuver au beurre",null,null,"❼","Dresser et servir"]
[null,null,null,null,null,null,null,null,null,null,null,null,null,null,null,null,null,null,null,null,null,null,null,null,null,null,null,null,null,null,null,null,null,null,null,null,null,null,null,null,null,"–  battre au fouet une substance ou un appareil pour le rendre plus léger et en augmenter le volume (ex : blanc en neige).",null,5,"faire sauter vivement",null,null,1,"Détailler chaque bac GN en 12 portions"]
[null,null,null,null,null,null,null,null,null,null,null,null,null,null,null,null,null,null,null,null,null,null,null,null,null,null,null,null,null,null,null,null,null,null,null,null,null,null,null,null,null,"– assembler les différentes parties d’une pâtisserie pour en faire un gâteau plus ou moins important (monter un entremet, pièce montée).",null,6,"faire suer",null,null,2,"Servir une portion sur chaque assiette et garnir de toasts (facultatif)"]
[null,null,null,null,null,null,null,null,null,null,null,null,null,null,null,null,null,null,null,null,null,null,null,null,null,null,null,null,null,null,null,null,null,null,null,null,null,null,null,null,null,"Mouler : verser une substance ou une préparation liquide ou semi-liquide dans un moule pour en obtenir une reproduction de sa forme après solidification.",null,7,"incorporer dans la sauce",null,null,3]
[null,null,null,null,null,null,null,null,null,null,null,null,null,null,null,null,null,null,null,null,null,null,null,null,null,null,null,null,null,null,null,null,null,null,null,null,null,null,null,null,null,"N",null,8,"lier la cuisson"]
[null,null,null,null,null,null,null,null,null,null,null,null,null,null,null,null,null,null,null,null,null,null,null,null,null,null,null,null,null,null,null,null,null,null,null,null,null,null,null,null,null,"Napper : verser sur un met chaud ou froid une sauce, une gelée, ou une crème pour le recouvrir complètement.",null,9,"lustrer à l'huie",null,null,"❽ ","Commentaires"]
[null,null,null,null,null,null,null,null,null,null,null,null,null,null,null,null,null,null,null,null,null,null,null,null,null,null,null,null,null,null,null,null,null,null,null,null,null,null,null,null,null,"P",null,10,"monter au beurre",null,null,"Ⓐ"," La brandade de morue n'est constituée que de poisson"]
[null,null,null,null,null,null,null,null,null,null,null,null,null,null,null,null,null,null,null,null,null,null,null,null,null,null,null,null,null,null,null,null,null,null,null,null,null,null,null,null,null,"Pasteuriser : action de soumettre une préparation à un traitement thermique (Température inférieure à 100°C), pendant un temps défini, afin de détruire d’éventuels germes pathogènes et de prolonger leur conservations.",null,11,"mouiller au vin blanc"]
[null,null,null,null,null,null,null,null,null,null,null,null,null,null,null,null,null,null,null,null,null,null,null,null,null,null,null,null,null,null,null,null,null,null,null,null,null,null,null,null,null,"Passer : faire traverser un liquide dans un ustensile percé de trous  pour en retenir en général les impuretés (ex : chinois,  passoire, tamis).",null,12,"napper de sauce",null,null,"Ⓑ","C'est à tort que l'on appelle brandade celle additionnée de purée de pomme de terre"]
[null,null,null,null,null,null,null,null,null,null,null,null,null,null,null,null,null,null,null,null,null,null,null,null,null,null,null,null,null,null,null,null,null,null,null,null,null,null,null,null,null,"Pâton : nom donné à un morceau de pâte pesé et prêt à être façonné.",null,13,"porter à ébullition"]
[null,null,null,null,null,null,null,null,null,null,null,null,null,null,null,null,null,null,null,null,null,null,null,null,null,null,null,null,null,null,null,null,null,null,null,null,null,null,null,null,null,"Piquer : percer de nombreux petits trous la surface d’une abaisse de pâte à l’aide d’une fourchette ou d’un pique vite, dans le but d’empêcher la formation de boursouflures durant la cuisson.",null,14,"rafraichir et égoutter",null,null,"Ⓒ"," La brandade de morue peut être accompagnée "]
[null,null,null,null,null,null,null,null,null,null,null,null,null,null,null,null,null,null,null,null,null,null,null,null,null,null,null,null,null,null,null,null,null,null,null,null,null,null,null,null,null,"Pincer : faire un décor sur le pourtour d’une tarte à l’aide d’une pince spéciale.",null,15,"réduire le vin",null,null,1,"de pommes de terre à l'anglaise"]
[null,null,null,null,null,null,null,null,null,null,null,null,null,null,null,null,null,null,null,null,null,null,null,null,null,null,null,null,null,null,null,null,null,null,null,null,null,null,null,null,null,"Pocher : opération qui consiste à cuire une préparation ou des aliments dans un liquide (eau, sirop, etc…) à une température basse, généralement comprise entre 70° et 85°C.",null,16,"sauter au beurre et à l'huile",null,null,2,"en robe des champs"]
[null,null,null,null,null,null,null,null,null,null,null,null,null,null,null,null,null,null,null,null,null,null,null,null,null,null,null,null,null,null,null,null,null,null,null,null,null,null,null,null,null,"Pointage : technique survenant après le pétrissage d’une pâte levée, fermentée, permettant à la première fermentation de se réaliser et de développer des arômes caractéristiques, mais aussi de renforcer le corps de la pâte avant son façonnage.",null,null,null,null,null,3,"ou de pommes purée à l'huile d'olive"]
[null,null,null,null,null,null,null,null,null,null,null,null,null,null,null,null,null,null,null,null,null,null,null,null,null,null,null,null,null,null,null,null,null,null,null,null,null,null,null,null,null,"Punch : mélange de sirop de sucre et d’un autre ingrédient (alcool, café, jus ou purée de fruits, vanille etc…).",null,null,null,null,null,4,"et de croûtons frits"]
[null,null,null,null,null,null,null,null,null,null,null,null,null,null,null,null,null,null,null,null,null,null,null,null,null,null,null,null,null,null,null,null,null,null,null,null,null,null,null,null,null,"Puncher (synonyme d’imbiber): rayer avec la pointe de la lame d’un couteau d’office, inciser de raies parallèles la surface de certains gâteaux préalablement passée à la dorure afin de parfaire la présentation.",null,1,"cuire à couvert"]
[null,null,null,null,null,null,null,null,null,null,null,null,null,null,null,null,null,null,null,null,null,null,null,null,null,null,null,null,null,null,null,null,null,null,null,null,null,null,null,null,null,"R",null,2,"cuire à feu doux"]
[null,null,null,null,null,null,null,null,null,null,null,null,null,null,null,null,null,null,null,null,null,null,null,null,null,null,null,null,null,null,null,null,null,null,null,null,null,null,null,null,null,"Retomber : se dit d’une pâte, d’un appareil dont le volume diminue après avoir augmenté pendant le montage ou la cuisson.",null,3,"cuire a feu vif",null,null,null,"Cette Méthode de fabrication est citée à titre d'exemple"]
[null,null,null,null,null,null,null,null,null,null,null,null,null,null,null,null,null,null,null,null,null,null,null,null,null,null,null,null,null,null,null,null,null,null,null,null,null,null,null,null,null,"Rognures : chutes de pâtisseries provenant de découpes de pâtes, d’entremets.",null,4,"cuire à four moyen"]
[null,null,null,null,null,null,null,null,null,null,null,null,null,null,null,null,null,null,null,null,null,null,null,null,null,null,null,null,null,null,null,null,null,null,null,null,null,null,null,null,null,"Rompre : actions manuelles consistant après un certain temps de pointage, a rabattre une pâte levée, fermentée, pour en chasser les gaz produits, avant le façonnage.",null,5,"cuire à la vapeur",null,null,null,"Je vous conseille de faire l'acquisition de l'excellent ouvrage de Michel Grossmann et Alain Le Franc"]
[null,null,null,null,null,null,null,null,null,null,null,null,null,null,null,null,null,null,null,null,null,null,null,null,null,null,null,null,null,null,null,null,null,null,null,null,null,null,null,null,null,"Ruban : préparation qui, après avoir été travaillé au fouet ou à la spatule, se glisse comme un ruban lorsqu’on la fait retomber de hauteur (ex : génoise).",null,6,"cuire à l'eau salée"]
[null,null,null,null,null,null,null,null,null,null,null,null,null,null,null,null,null,null,null,null,null,null,null,null,null,null,null,null,null,null,null,null,null,null,null,null,null,null,null,null,null,"S",null,7,"cuire légèrement croquant"]
[null,null,null,null,null,null,null,null,null,null,null,null,null,null,null,null,null,null,null,null,null,null,null,null,null,null,null,null,null,null,null,null,null,null,null,null,null,null,null,null,null,"Sabler : opération qui consiste à brasser de la farine et de la matière grasse jusqu’à l’obtention d’un mélange rappelant la texture du sable.",null,8,"cuire sans coloration",null,null,null,"LA CUISINE DE COLLECTIVITÉ"]
[null,null,null,null,null,null,null,null,null,null,null,null,null,null,null,null,null,null,null,null,null,null,null,null,null,null,null,null,null,null,null,null,null,null,null,null,null,null,null,null,null,"T",null,9,"enfourner et cuire",null,null,null,"Cuisine et Pâtisserie"]
[null,null,null,null,null,null,null,null,null,null,null,null,null,null,null,null,null,null,null,null,null,null,null,null,null,null,null,null,null,null,null,null,null,null,null,null,null,null,null,null,null,"Tabler : technique de pré-cristallisation du chocolat de couverture sur un marbre.",null,10,"finir de cuire",null,null,null,"300 Fiches Techniques"]
[null,null,null,null,null,null,null,null,null,null,null,null,null,null,null,null,null,null,null,null,null,null,null,null,null,null,null,null,null,null,null,null,null,null,null,null,null,null,null,null,null,null,null,11,"griller et finir au four",null,null,null,"Éditions BPI 2006"]
[null,null,null,null,null,null,null,null,null,null,null,null,null,null,null,null,null,null,null,null,null,null,null,null,null,null,null,null,null,null,null,null,null,null,null,null,null,null,null,null,null,"Tourer : action de plier  en trois ou en quatre un pâton de pâte levée, feuilletée, après l’avoir allongée.",null,12,"laisser cuire"]
[null,null,null,null,null,null,null,null,null,null,null,null,null,null,null,null,null,null,null,null,null,null,null,null,null,null,null,null,null,null,null,null,null,null,null,null,null,null,null,null,null,"Tremper :",null,13,"passer au four très chaud"]
[null,null,null,null,null,null,null,null,null,null,null,null,null,null,null,null,null,null,null,null,null,null,null,null,null,null,null,null,null,null,null,null,null,null,null,null,null,null,null,null,null,"–  imbiber une pièce de pâtisseries avec du sirop",null,14,"piquer la sonde à cœur"]
[null,null,null,null,null,null,null,null,null,null,null,null,null,null,null,null,null,null,null,null,null,null,null,null,null,null,null,null,null,null,null,null,null,null,null,null,null,null,null,null,null,"–  enrober des bonbons, des intérieurs, des fruits dans du chocolat de couverture ou du fondant.",null,15,"préchauffer le four"]
[null,null,null,null,null,null,null,null,null,null,null,null,null,null,null,null,null,null,null,null,null,null,null,null,null,null,null,null,null,null,null,null,null,null,null,null,null,null,null,null,null,"V"]
[null,null,null,null,null,null,null,null,null,null,null,null,null,null,null,null,null,null,null,null,null,null,null,null,null,null,null,null,null,null,null,null,null,null,null,null,null,null,null,null,null,"Vanner : remuer une sauce ou une crème pendant son refroidissement pour la rendre homogène, limité son dessèchement en surface et accélérer sa descente en température."]
[null,null,null,null,null,null,null,null,null,null,null,null,null,null,null,null,null,null,null,null,null,null,null,null,null,null,null,null,null,null,null,null,null,null,null,null,null,null,null,null,null,"Z",null,1,"disperser au fouet"]
[null,null,null,null,null,null,null,null,null,null,null,null,null,null,null,null,null,null,null,null,null,null,null,null,null,null,null,null,null,null,null,null,null,null,null,null,null,null,null,null,null,"Zeste : peau découpée dans l’écorce des agrumes.",null,2,"dresser à la poche"]
[null,null,null,null,null,null,null,null,null,null,null,null,null,null,null,null,null,null,null,null,null,null,null,null,null,null,null,null,null,null,null,null,null,null,null,null,null,null,null,null,null,"Zester : retirer la partie extérieure de l’écorce d’agrumes (citrons, oranges, pamplemousse….) à l’aide d’un zesteur ou d’une râpe.",null,3,"dresser sur assiette"]
[null,null,null,null,null,null,null,null,null,null,null,null,null,null,null,null,null,null,null,null,null,null,null,null,null,null,null,null,null,null,null,null,null,null,null,null,null,null,null,null,null,null,null,4,"mélanger et porter à ébullition"]
[null,null,null,null,null,null,null,null,null,null,null,null,null,null,null,null,null,null,null,null,null,null,null,null,null,null,null,null,null,null,null,null,null,null,null,null,null,null,null,null,null,null,null,5,"mixer et passer au chinois"]
[null,null,null,null,null,null,null,null,null,null,null,null,null,null,null,null,null,null,null,null,null,null,null,null,null,null,null,null,null,null,null,null,null,null,null,null,null,null,null,null,"Lien >","https://www.passionpatisserie.fr/lexique",null,6,"rectifier l'assaisonnement"]
[null,null,null,null,null,null,null,null,null,null,null,null,null,null,null,null,null,null,null,null,null,null,null,null,null,null,null,null,null,null,null,null,null,null,null,null,null,null,null,null,null,null,null,7,"rendre onctueux l'appareil"]
[null,null,null,null,null,null,null,null,null,null,null,null,null,null,null,null,null,null,null,null,null,null,null,null,null,null,null,null,null,null,null,null,null,null,null,null,null,null,null,null,"Lien >","http://devenir.patissier.free.fr/cours-CAP-vocabulaire-professionnel-eleve.pdf",null,8,"répartir le fond de cuisson"]
[]
[null,null,null,null,null,null,null,null,null,null,null,null,null,null,null,null,null,null,null,null,null,null,null,null,null,null,null,null,null,null,null,null,null,null,null,null,null,null,null,null,"Lien >","http://technologiepatisserie.blogspot.com/p/le-vocabulaire-professionnel-en.html"]
[null,null,null,null,null,null,null,null,null,null,null,null,null,null,null,null,null,null,null,null,null,null,null,null,null,null,null,null,null,null,null,null,null,null,null,null,null,null,null,null,null,null,null,1,"débarrasser dans un récipient"]
[null,null,null,null,null,null,null,null,null,null,null,null,null,null,null,null,null,null,null,null,null,null,null,null,null,null,null,null,null,null,null,null,null,null,null,null,null,null,null,null,"Lien >","https://devenirpatissier.fr/vocabulaire-professionnel/",null,2,"filmer et stocker en chambre froide"]
[null,null,null,null,null,null,null,null,null,null,null,null,null,null,null,null,null,null,null,null,null,null,null,null,null,null,null,null,null,null,null,null,null,null,null,null,null,null,null,null,null,null,null,3,"refroidir en cellule"]
[null,null,null,null,null,null,null,null,null,null,null,null,null,null,null,null,null,null,null,null,null,null,null,null,null,null,null,null,null,null,null,null,null,null,null,null,null,null,null,null,"Lien >","https://www.encoreungateau.com/pourquoi-un-blog-de-patisserie/vocabulaire-du-patissier/",null,4,"réserver au frais"]
[null,null,null,null,null,null,null,null,null,null,null,null,null,null,null,null,null,null,null,null,null,null,null,null,null,null,null,null,null,null,null,null,null,null,null,null,null,null,null,null,null,null,null,5,"réserver au froid"]
[null,null,null,null,null,null,null,null,null,null,null,null,null,null,null,null,null,null,null,null,null,null,null,null,null,null,null,null,null,null,null,null,null,null,null,null,null,null,null,null,null,null,null,6,"reserver dans des bacs"]
[null,null,null,null,null,null,null,null,null,null,null,null,null,null,null,null,null,null,null,null,null,null,null,null,null,null,null,null,null,null,null,null,null,null,null,null,null,null,null,null,null,null,null,7,"stocker en chambre froide"]
[]
[]
[null,null,null,null,null,null,null,null,null,null,null,null,null,null,null,null,null,null,null,null,null,null,null,null,null,null,null,null,null,null,null,null,null,null,null,null,null,null,null,null,null,null,null,1,"maintenir à température + 63°C"]
[null,null,null,null,null,null,null,null,null,null,null,null,null,null,null,null,null,null,null,null,null,null,null,null,null,null,null,null,null,null,null,null,null,null,null,null,null,null,null,null,null,null,null,2,"maintenir au bain marie + 65°C"]
[null,null,null,null,null,null,null,null,null,null,null,null,null,null,null,null,null,null,null,null,null,null,null,null,null,null,null,null,null,null,null,null,null,null,null,null,null,null,null,null,null,null,null,3,"maintenir au froid + 3°C maxi"]
[null,null,null,null,null,null,null,null,null,null,null,null,null,null,null,null,null,null,null,null,null,null,null,null,null,null,null,null,null,null,null,null,null,null,null,null,null,null,null,null,null,null,null,4,"servir tiède"]

{"sheet":"Cuisiniers.Pesez","index":9,"n_rows":877,"n_cols":17,"rows_kept":877,"cut":false,"hidden":false,"merged":[[825,1,825,13],[829,0,830,16],[819,5,819,6],[819,8,819,9],[819,11,819,12],[821,1,822,13],[823,2,823,13],[824,2,824,13],[793,0,825,0],[793,1,793,13],[794,1,797,13],[798,1,798,13],[799,11,799,12],[800,11,801,12],[807,1,807,13],[808,11,808,12],[809,11,809,12],[819,2,819,3],[791,0,792,0],[791,1,792,12],[791,13,792,13],[771,11,771,12],[783,2,783,3],[783,5,783,6],[783,8,783,9],[783,11,783,12],[785,1,786,13],[748,1,748,13],[752,9,752,11],[762,0,763,0],[762,1,763,12],[762,13,763,13],[764,0,789,0],[764,1,764,13],[765,1,768,13],[769,1,769,13],[770,11,770,12],[787,2,787,13],[788,2,788,13],[789,1,789,13],[736,2,736,3],[736,4,736,5],[737,2,737,3],[737,4,737,5],[740,2,742,12],[746,1,746,13],[733,2,733,3],[733,4,733,5],[734,2,734,3],[734,4,734,5],[735,2,735,3],[735,4,735,5],[730,2,730,3],[730,4,730,5],[731,2,731,3],[731,4,731,5],[732,2,732,3],[732,4,732,5],[727,2,727,3],[727,4,727,5],[728,2,728,3],[728,4,728,5],[729,2,729,3],[729,4,729,5],[723,2,724,3],[723,4,724,5],[723,6,724,6],[723,7,724,12],[725,2,725,12],[726,2,726,3],[726,4,726,5],[717,2,717,3],[717,4,717,5],[717,6,717,8],[721,2,722,3],[721,4,722,5],[721,6,722,6],[721,7,721,12],[714,2,715,3],[714,4,715,5],[714,6,715,8],[714,12,715,12],[716,2,716,3],[716,4,716,5],[716,6,716,8],[709,2,709,3],[709,4,709,5],[710,2,710,3],[710,4,710,5],[712,2,712,12],[713,4,713,12],[688,5,689,5],[688,6,689,6],[688,7,689,7],[703,2,703,12],[704,2,704,12],[705,4,705,12],[706,2,706,12],[707,2,708,3],[707,4,708,5],[691,10,692,11],[693,2,694,2],[693,3,694,3],[693,4,694,5],[693,6,694,6],[693,7,694,7],[693,9,694,9],[693,10,694,11],[691,2,692,2],[691,3,692,3],[691,4,692,5],[691,6,692,6],[691,7,692,7],[691,8,692,9],[666,3,666,5],[668,3,668,5],[670,3,670,5],[675,2,675,11],[677,2,680,11],[681,2,684,11],[688,8,689,8],[688,9,689,9],[653,2,655,2],[654,3,654,5],[655,3,655,5],[657,2,662,2],[658,3,658,5],[659,3,659,5],[660,3,660,5],[661,3,661,5],[662,3,662,5],[685,2,686,5],[685,6,686,7],[685,8,686,8],[685,9,686,10],[685,11,686,11],[688,2,689,3],[688,4,689,4],[643,2,643,4],[647,2,647,11],[648,2,648,11],[649,2,649,11],[650,2,650,11],[651,2,651,11],[641,2,641,4],[641,7,641,8],[641,10,641,11],[642,2,642,4],[642,7,642,8],[642,10,642,11],[639,2,639,4],[639,7,639,8],[639,10,639,11],[640,2,640,4],[640,7,640,8],[640,10,640,11],[637,2,637,4],[637,7,637,8],[637,10,637,11],[638,2,638,4],[638,7,638,8],[638,10,638,11],[635,2,635,4],[635,7,635,8],[635,10,635,11],[636,2,636,4],[636,7,636,8],[636,10,636,11],[612,1,612,5],[616,1,616,6],[617,1,617,6],[623,1,623,5],[627,1,627,4],[634,2,634,11],[580,6,580,7],[581,6,581,7],[585,6,585,7],[586,6,586,7],[603,1,603,6],[609,1,609,4],[568,12,568,13],[569,6,570,7],[569,12,569,13],[571,12,571,13],[576,12,576,13],[578,6,579,7],[530,1,530,9],[543,1,543,6],[543,8,543,13],[551,9,551,13],[561,12,561,13],[562,6,563,7],[562,12,562,13],[499,1,499,13],[500,0,516,0],[500,1,501,13],[502,1,503,13],[504,1,504,13],[506,1,506,2],[506,6,506,7],[506,10,506,11],[515,1,516,13],[468,1,468,4],[470,1,471,16],[473,1,473,13],[474,0,497,0],[474,1,475,13],[476,1,477,13],[487,2,487,12],[488,7,488,12],[489,3,489,4],[496,1,497,13],[464,1,465,1],[464,2,465,2],[464,3,465,3],[464,4,465,4],[464,7,464,13],[465,7,466,7],[465,8,466,8],[465,9,466,9],[465,10,466,10],[465,11,466,11],[465,12,466,12],[465,13,466,13],[466,1,467,1],[466,2,467,2],[466,3,467,3],[466,4,467,4],[467,7,467,13],[460,13,461,13],[461,1,462,1],[461,2,462,2],[461,3,462,3],[461,4,462,4],[462,7,463,7],[462,8,463,8],[462,9,463,9],[462,10,463,10],[462,11,463,11],[460,7,461,7],[460,8,461,8],[460,9,461,9],[460,10,461,10],[460,11,461,11],[460,12,461,12],[462,12,463,12],[462,13,463,13],[453,1,454,1],[453,2,454,6],[455,1,456,1],[455,2,456,6],[459,1,460,2],[459,3,460,3],[459,4,460,4],[448,2,448,6],[448,8,448,9],[449,2,449,6],[450,2,450,6],[451,2,451,6],[452,2,452,6],[444,1,445,6],[444,8,444,9],[445,8,445,9],[446,2,446,6],[446,8,446,9],[447,2,447,6],[447,8,447,9],[429,5,429,8],[430,5,430,8],[430,10,430,13],[433,10,433,12],[442,1,443,6],[442,8,443,9],[442,10,443,11],[442,12,443,12],[442,13,443,13],[420,5,421,8],[420,10,421,13],[422,10,422,13],[423,5,423,8],[423,10,423,13],[424,10,425,10],[424,11,425,11],[424,12,425,12],[424,13,425,13],[410,1,410,2],[410,5,410,6],[410,8,410,9],[410,12,410,13],[411,1,415,1],[411,2,415,2],[411,8,415,8],[411,9,415,9],[383,9,384,9],[389,1,391,9],[392,1,393,9],[401,1,402,9],[409,1,409,6],[409,8,409,13],[375,1,376,9],[379,1,380,9],[381,1,382,9],[383,1,384,2],[383,3,384,3],[383,4,384,4],[383,5,384,5],[383,6,384,6],[383,7,384,7],[383,8,384,8],[355,2,357,12],[363,2,364,12],[370,2,371,12],[373,1,373,9],[374,1,374,9],[342,8,343,8],[342,11,343,11],[342,12,343,12],[344,3,344,8],[349,9,350,10],[349,11,350,12],[340,3,340,12],[341,2,341,11],[342,2,343,2],[342,3,343,3],[342,4,343,4],[342,5,343,5],[342,6,343,6],[342,7,343,7],[354,3,354,12],[331,8,333,8],[331,11,333,11],[331,12,333,12],[335,2,336,2],[335,3,336,3],[335,4,336,4],[335,5,336,5],[335,6,336,6],[335,7,336,7],[335,8,336,8],[331,2,333,2],[331,3,333,3],[331,4,333,4],[331,5,333,5],[331,6,333,6],[331,7,333,7],[335,11,336,11],[335,12,336,12],[320,1,321,10],[323,1,325,13],[326,2,326,12],[327,2,327,12],[328,2,329,12],[330,3,330,12],[318,1,318,2],[318,4,318,5],[318,7,318,8],[319,1,319,2],[319,4,319,5],[319,7,319,8],[312,1,312,10],[313,2,313,10],[314,1,315,1],[314,2,315,10],[316,1,316,10],[317,1,317,4],[309,1,309,10],[310,1,311,1],[310,2,311,3],[310,4,311,5],[310,6,311,7],[310,8,311,9],[310,10,311,10],[306,1,307,1],[306,2,307,3],[306,4,307,5],[306,6,307,7],[306,8,307,9],[306,10,307,10],[298,8,298,12],[299,8,300,12],[302,1,303,10],[304,1,304,10],[305,2,305,3],[305,4,305,5],[305,6,305,7],[305,8,305,9],[294,12,295,12],[296,1,296,6],[296,8,297,8],[296,9,297,9],[296,10,297,10],[296,11,297,11],[296,12,297,12],[292,12,293,12],[294,1,295,1],[294,2,295,2],[294,3,295,3],[294,4,295,4],[294,5,295,6],[294,8,295,8],[294,9,295,9],[294,10,295,10],[294,11,295,11],[290,1,291,6],[290,8,291,8],[290,9,291,9],[290,10,291,10],[290,11,291,11],[290,12,291,12],[292,1,293,1],[292,2,293,2],[292,3,293,3],[292,4,293,4],[292,5,293,6],[292,8,293,8],[292,9,293,9],[292,10,293,10],[292,11,293,11],[276,12,277,12],[276,13,277,13],[280,8,281,13],[283,8,285,12],[286,1,288,5],[286,8,287,8],[286,9,287,9],[286,10,287,10],[286,11,287,11],[286,12,287,12],[288,8,289,8],[288,9,289,9],[288,10,289,10],[288,11,289,11],[288,12,289,12],[270,12,271,12],[270,13,271,13],[272,1,274,6],[272,8,273,13],[274,8,275,8],[274,9,275,9],[274,10,275,10],[274,11,275,11],[274,12,275,12],[274,13,275,13],[270,0,288,0],[270,1,271,6],[270,8,271,8],[270,9,271,9],[270,10,271,10],[270,11,271,11],[276,8,277,8],[276,9,277,9],[276,10,277,10],[276,11,277,11],[259,4,260,4],[259,5,260,5],[260,8,260,14],[266,1,267,6],[266,8,267,13],[268,8,269,8],[268,9,269,9],[268,10,269,10],[268,11,269,11],[268,12,269,12],[268,13,269,13],[269,1,269,6],[243,0,267,0],[250,1,250,6],[254,8,254,14],[255,8,258,8],[255,9,258,9],[255,10,256,11],[255,12,256,12],[255,13,256,13],[255,14,256,14],[256,5,256,6],[261,8,262,14],[262,1,263,1],[262,2,263,2],[262,4,263,4],[262,5,263,5],[264,1,264,6],[264,8,265,13],[257,5,257,6],[257,10,258,11],[257,12,258,12],[257,13,258,13],[257,14,258,14],[259,1,260,1],[259,2,260,2],[235,1,235,4],[235,6,235,8],[235,10,235,12],[235,14,235,16],[238,1,238,3],[242,1,243,6],[242,8,242,14],[231,1,231,4],[231,6,231,8],[231,10,231,12],[231,14,231,15],[232,14,232,15],[234,6,234,8],[229,1,229,4],[229,6,229,8],[229,10,229,12],[229,14,229,15],[230,1,230,4],[230,6,230,8],[230,10,230,12],[230,14,230,15],[227,1,227,4],[227,6,227,8],[227,10,227,12],[227,14,227,15],[228,1,228,4],[228,6,228,8],[228,10,228,12],[228,14,228,15],[225,1,225,4],[225,6,225,8],[225,10,226,12],[225,14,225,15],[226,1,226,4],[226,6,226,8],[226,14,226,15],[223,1,223,4],[223,6,223,8],[223,10,223,12],[223,14,223,15],[224,1,224,4],[224,6,224,8],[224,10,224,12],[224,14,224,15],[218,1,218,16],[219,1,220,16],[221,1,221,16],[222,1,222,4],[222,6,222,8],[222,10,222,12],[222,14,222,15],[144,2,144,5],[147,2,147,6],[151,2,151,7],[153,2,153,5],[155,2,155,5],[157,2,157,5],[128,2,128,5],[131,2,131,8],[133,2,133,3],[136,2,136,5],[139,2,139,5],[142,2,142,3],[113,1,115,1],[113,2,115,10],[116,1,120,1],[116,2,120,10],[124,2,124,7],[126,2,126,5],[106,2,106,10],[107,2,107,10],[108,2,108,10],[109,2,109,10],[110,1,112,1],[110,2,112,10],[72,12,74,15],[73,2,73,4],[75,2,75,5],[75,12,77,15],[85,1,85,11],[87,4,91,11],[68,12,71,15],[69,2,69,4],[71,2,71,4],[11,1,11,16],[43,12,48,15],[50,12,53,15],[58,12,61,15],[60,2,60,7],[62,12,64,15],[63,2,63,9],[1,1,1,16],[2,1,2,16],[3,1,3,16],[4,1,4,16],[5,2,5,16],[7,1,9,16],[65,2,65,5],[67,2,67,3],[67,12,67,15]]}
[{"$f":"CELL(\"largeur\",A1)","v":3},15,15,15,15,15,15,15,15,15,15,15,15,15,11,16,11]
[null,"Cuisiniers : PESEZ …..Evitez les volumes , n'utilisez que les poids comme les pâtissiers"]
[null,"Les cuisiniers \"sont des artistes\"……..ce qui ne doit pas les empêcher … d'UTILISEZ UNE BALANCE…...les résultats seront plus réguliers"]
[null,"Cuisiniers : PESEZ …..même le sel…..on ne sale pas 50L de sauce à la \"chichette\" au \"pif\" ou à l'expérience"]
[null," la sauce crémée ne se sale pas comme la sauce tomatée etc……."]
[null,"lien >","Les unités pifométriques"]
[]
[null,"Mise à jour du 16 décembre 2017 - Annule ou complète les versions précédentes lies liens sont parfois éphémères; pas de panique…..demandez à Google …il vous retrouvera un lien équivalent"]
[]
[]
[]
[null,"J'attire votre attention pour la saisie des quantités    supposons qu'il y ait 400g de viande 2 œufs ou 2 pieds de veau et 5 cl de crème dans la recette …..Excel aura du mal à faire la différence"]
[]
[null,null,"ATTENTION : les saisies des poids unitaires se font en gramme"]
[]
[null,null,"Unités","Quoi","Poids Unitaire","❹ ingrédients",null,null,null,null,null,null,null,"quelques numérotation pour les process"]
[]
[null,null,"pour 1.050Kg  saisissez 1050 la cellule est formatée pour ajouter g",null,null,null,null,null,null,null,null,null,null,"❶"]
[null,null,null,null,1050,"bœuf",null,null,null,null,null,null,null,"❷","Vous pouvez coller ces formes dans vos fiches"]
[null,null,null,null,400,"veau",null,null,null,null,null,null,null,"❸"]
[null,null,null,null,null,null,null,null,null,null,null,null,null,"❹"]
[null,null,"le poids UNITAIRE pour les RECETTES AU POIDS est indispensable",null,null,null,null,null,null,null,null,null,null,"❺"]
[null,null,"(pas le poids des 2 œufs \"100g\" mais le poids d'UN œuf de 50g par exemple)",null,null,null,null,null,null,null,null,null,null,"❻"]
[null,null,null,null,null,null,null,null,null,null,null,null,null,"❼"]
[null,null,"Unités","Quoi","Poids Unitaire","❹ ingrédients",null,null,null,null,null,null,null,"❽"]
[null,null,2,"œufs",50,"Œufs de 50 g",null,null,null,null,null,null,null,"❾"]
[null,null,"saisir QUOI pour les œufs n'est pas obligatoire ",null,null,null,null,null,null,null,null,null,null,"❿"]
[null,null,"mais pour une pincée d'épices…une cuillère à café….une brindille c'est indispensable",null,null,null,null,null,null,null,null,null,null,"⓫"]
[null,null,null,null,null,null,null,null,null,null,null,null,null,"⓬"]
[null,null,"Recettes à la PORTION",null,null,null,null,null,null,null,null,null,null,"⓭"]
[null,null,"pour les recettes à la portion vous avez la possibilité de ne pas ajouter le poids unitaire de certains ingrédients",null,null,null,null,null,null,null,null,null,null,"⓮"]
[null,null,"si vous saisissez 2 œufs c'est possible; mais pas dans la même colonne cela fausserait le poids total ",null,null,null,null,null,null,null,null,null,null,"⓯"]
[null,null,"Excel calculera 2 comme 2 Kg",null,null,null,null,null,null,null,null,null,null,"⓰"]
[null,null,"donc pour les produits à l'unité saisissez vos valeurs dans la première colonne",null,null,null,null,null,null,null,null,null,null,"⓱"]
[null,null,null,null,null,null,null,null,null,null,null,null,null,"⓲"]
[null,null,"Unités","Quoi","Poids Unitaire","❹ ingrédients",null,"FORMATS POUR LES FICHES AU Kg",null,null,"rapportez tout au Kg = 0,400 Kg de viande",null,null,"⓳"]
[null,null,2,"œufs",null,"Œufs de 50 g",2,"œufs",0.05,2,"œufs",0.05,"Œufs de 50 g","⓴"]
[null,null,5,"C/C",null,"vinaigre",5,"C/C",null,5,"C/C",null,"vinaigre"]
[null,null,1,"pincée",null,"paprika",1,"pincée",null,1,"pincée",null,"paprika",null,"symbole diamètre "]
[null,null,1,"branche",null,"laurier",1,"branche",null,1,"branche",null,"laurier",null," Ø"]
[null,null,1,"pied",null,"pied de veau",1,"pied",null,1,"pied",null,"pied de veau",null,"\u0098"]
[null,null,null,null,null,null,null,null,null,null,null,null,null,"\u0084","\u0083"]
[null,null,"les ¼ de botte de fines herbes en 0,25 les demi = 0.5 les 3/4 = 0.75"]
[null,null," idem pour les feuilles de gélatine les pieds de veau -les feuilles de basilic etc….",null,null,null,null,null,null,null,null,null,"Avant de saisir quoi que ce soit dans une cellule cliquez dessus pour vérifier qu'il n'y ait pas de formule"]
[null,null,0.5,"feuilles",null,"gélatine",null,"C/C","cuillère/Café"]
[null,null,0.25,"botte",null,"fines herbes",null,"C/P","cuillère/Potage"]
[]
[null,null,"Convertissez tout de suite les volumes en poids sur la base de 1L = 1Kg "]
[null,null,"5 cl = 50g"]
[null,null,"sauf cas exeptionnel pour recettes de précision "]
[null,null,null,"Pour le lait entier, la densité donnée habituellement est de 1,030 par rapport à l'eau qui est de 1. ",null,null,null,null,null,null,null,null,"Pour imprimer : sélectionnez les recettes qui vous conviennent : définir la zone d'impression -Mise à l'échelle : Ajuster la feuille à 1 page"]
[null,null,null,"On peut donc considérer que les 0,030 corespondent à la graisse du lait entier. "]
[null,null,null,"Pour le lait demi-écrémé, la graisse ne devrait représenter que 0,030/2, donc 0,015. "]
[null,null,null,"Donc la masse d'un litre de lait demi-écrémé doit être de 1,015 Kg (1015 g)."]
[]
[]
[]
[null,null,"Poids des aliments sur internet"]
[null,"lien >","http://www.aliments.org/poids.htm",null,null,null,null,null,null,null,null,null,"les valeurs #DIV/0!  indiquent seulement que les recettes sont \"vierges\" sur la feuille de saisie "]
[]
[null,"lien >","http://www.nubel.be/fra/manual/liste_des_denrees_alimentaires.asp"]
[]
[null,null,"Tableau des calibres Fruits Frais",null,null,null,null,null,null,null,null,null,"si vous n'utilisez pas toutes les lignes vous pouvez masquer cette valeur par une couleur de police BLANC"]
[null,"lien >","http://www.crenoexpert.fr/flipbooks/expproduit/TABLEAUX-CALIBRES-FRUITS-2.pdf"]
[]
[null,"lien >","ff-documents-apprentis-Patissiers.xlsx"]
[]
[null,"lien >","ff-Croquis.xlsx",null,null,null,null,null,null,null,null,null,"POUR LES FICHES RECETTES A LA PORTION"]
[null,null,null,null,null,null,null,null,null,null,null,null," Nb de portions Si vous estimez que les grammages sont trop ou pas assez copieux pour vos convives : modifiez les sur ces tableaux les modifications se feront sur le tableau à imprimer"]
[null,"lien >","ff-qualiterecettes2007.xls"]
[]
[null,"lien >","ff-tableau-cuisson.pdf"]
[null,null,null,null,null,null,null,null,null,null,null,null,"Pas assez copieux : diminuez le nombre de portions cela augmentera les grammages à la portion sur le tableau à imprimer"]
[null,"lien >","PT-bonnes-pratiques.doc   "]
[]
[null,"lien >","Banque d'images pour agrémenter vos documents",null,null,null,null,null,null,null,null,null,"Trop copieux : augmentez le nombre de portions cela diminuera les grammages à la portion sur le tableau à imprimer"]
[]
[]
[]
[]
[]
[null,null,"Numérotation Format : Images pour compléter parce que les Symboles sont limités au N° 20"]
[]
[]
[]
[null,"formats personnalisés"]
[]
[null,"0.00\\ \" cm³\"",3,null,"Dans caractères spéciaux => symboles => Nombres et symboles. Là tu descends (tu as d'abord une série de nombre entourés, puis des nombres sous fractions, ...) et enfin tu as deux lignes de 0 à 9 écrit petit, ceux sont eux, les exposants et les indices."]
[]
[null,"le ³ se fait en tapant alt+0179"]
[]
[null,"le ² se fait en tapant alt+0178"]
[]
[null,null,null,null,null,"ou en copier-coller","m² ","M² ","m³ ","M³ ","cm² ","cm³ "]
[]
[null,"Format | cellule | personnalisé | 0\" m²\"",null,null,null,"❶","❷","❸","❹","❺","X","t"]
[]
[null,"❻","❼","❽","❾","❿","⓫","⓬","⓭","⓮","Z","q"]
[]
[null,null,null,"N° de colonne",{"$f":"COLUMN()","v":5},null,"Adresse de cellule",{"$f":"ADDRESS(ROW(),COLUMN(),4)","v":"H100"},null,null,"u","p"]
[]
[null,null,null,"Fonction : Adresse colonne",{"$f":"LEFT(ADDRESS(1,COLUMN(),4),LEN(ADDRESS(1,COLUMN(),4))-1)","v":"E"},null,"N° de ligne",{"$f":"ROW()","v":102},null,"le ³ se fait en tapant alt+0179"]
[]
[null,null,"Adresse PC",{"$f":"CELL(\"nomfichier\")","v":"E:\\0-UPRT\\1-UPRT.FR-SITE-WEB\\re-recettes-jean-marc-catteau\\re-catteau-galettes\\[GA-pate.sud.finistere.xlsm]Modes.d'emploi"}]
[]
[]
[null,"A","TEST POLICE DE CARACTERES"]
[null,"B","Saisir une ou des lettres / nombres ou une phrase cellule C jaune"]
[null,"C","Saisir ICI"]
[null,null,"Sélectionnez toute les cellules  ci-dessous et changez de police de caractère pour voir"]
[null,"C",{"$f":"C109","v":"Saisir ICI"}]
[]
[]
[null,"A",{"$f":"+C107","v":"TEST POLICE DE CARACTERES"}]
[]
[]
[null,"B",{"$f":"+C108","v":"Saisir une ou des lettres / nombres ou une phrase cellule C jaune"}]
[]
[]
[]
[]
[]
[]
[null,null,"Tables des caractères Unicode - Alphanumériques cerclés"]
[null,"lien >","caractères  Alphanumériques cerclés"]
[]
[null,"lien >","http://unicode.org/"]
[]
[null,"lien >","visualiseur d'Emoji et de symboles"]
[]
[null,null,"Sélection de polices pour l'école "]
[null,"lien >","https://pragmatice.net/kitinstit/3_installer_produire_polices_selection.htm"]
[]
[null,"lien >","http://www.philing.net/"]
[]
[null,null,"Petites leçons de Typographie"]
[null,"lien >","http://jacques-andre.fr/faqtypo/lessons.pdf"]
[]
[null,null,"Document à télécharger"]
[null,"lien >","Mémo caractères spéciaux sous Windows "]
[]
[null,null,"Polices de Caractères à Télécharger"]
[null,"lien >","http://fr.fontriver.com/"]
[]
[null,"lien >","http://fr.fonts2u.com/category.html?id=21"]
[]
[null,null,"Retrouver une police utilisée - TechTour : Démo "]
[null,"lien >","https://www.youtube.com/watch?v=wMgBzUHzKvM"]
[]
[]
[null,"3 sites à conserver pour vos recherches de formules Excel "]
[null,null,"https://web.archive.org/web/20150919082310/http://www.excelabo.net/"]
[]
[null,null,"http://www.mdf-xlpages.com/modules/publisher/"]
[]
[null,null,"Excel Québec : Formules et fonctions Excel"]
[]
[null,null,"https://www.excel-downloads.com/resources/"]
[]
[null,"Utilitaire pour supprimer les espace vides dans une phrase"]
[null,null,null,"exemple de texte avec espaces (83 caractères en comptant les espaces)"]
[null,null,null,"•Contamination microbiologique (B)             •Multiplication des germes (B)      "]
[null,null,null,"•Contaminationmicrobiologique(B)•Multiplicationdesgermes(B)",null,null,null,null,"59 caractères en comptant les points"]
[null,"Collez votre texte avec espaces dans la cellule blanche"]
[null,null,null,{"$f":"LEN(F165)","v":58},"Caractères","Utilitaire pour supprimer les espace vides dans une phrase"]
[]
[null,"Récupérez votre texte dans la cellule verte "]
[null,null,null,{"$f":"LEN(F168)","v":50},"Caractères",{"$f":"SUBSTITUTE(F165,\" \",\"\")","v":"Utilitairepoursupprimerlesespacevidesdansunephrase"}]
[null,null,"cliquez sur la cellule verte puis sur sur Copier "]
[null,null,"placez vous dans votre document : "]
[null,null," puis collage spécial Valeur pour ne pas copier la formule"]
[]
[null,null,"la formule utilisée : ","SUBSTITUE(G525;\" \";\"\")"]
[]
[]
[null,null,null,"Excel Québec : Formules et fonctions Excel"]
[]
[null,null,"Quelques fonctions d'excel",null,null,null,null,null,"Publié le","Vues"]
[null,null,"Rechercher une Fonction",null,null,null,null,null,"2013-05-28",4416]
[null,null,"T() - Tester et renvoyer du texte",null,null,null,null,null,"2012-07-02",14900]
[null,null,"EPURAGE() - Supprimer certains caractères indésirables",null,null,null,null,null,"2012-06-02",36257]
[null,null,"REMPLACER() - Echanger une chaîne de caractères par une autre",null,null,null,null,null,"2012-06-02",14390]
[null,null,"CTXT() - Convertir un nombre en texte",null,null,null,null,null,"2012-05-23",48910]
[null,null,"REPT() - Répéter des caractères un certain nombre de fois",null,null,null,null,null,"2012-04-26",14751]
[null,null,"L'Assistant Somme Conditionnelle",null,null,null,null,null,"2011-11-01",10084]
[null,null,"CELLULE() - Nom de l'onglet, du fichier ou du répertoire dans une cellule",null,null,null,null,null,"2010-10-03",45222]
[null,null,"EXACT() - Comparer deux chaînes de texte",null,null,null,null,null,"2010-04-26",65784]
[null,null,"Purgez les espaces inutiles !",null,null,null,null,null,"2010-04-05",96965]
[null,null,"SUPPRESPACE() - Supprimer les espaces inutiles dans une cellule",null,null,null,null,null,"2010-04-05",45902]
[null,null,"STXT() - Extraire une chaîne de caractères au sein d'une autre",null,null,null,null,null,"2010-03-13",122444]
[null,null,"CHERCHE() TROUVE() - Retourne la position d'une chaîne de caractères",null,null,null,null,null,"2010-01-04",100241]
[null,null,"NBCAR() - Compter les caractères d'une chaîne de texte ou d'une plage de cellules",null,null,null,null,null,"2009-11-21",23956]
[null,null,"SUBSTITUE() - Remplacer une chaîne de texte par une autre",null,null,null,null,null,"2009-11-08",113684]
[null,null,"CAR() - CODE() : Utilisation des codes caractères",null,null,null,null,null,"2009-10-25",27154]
[null,null,"CONCATENER() - Assembler plusieurs chaînes de texte en une seule.",null,null,null,null,null,"2009-10-10",25774]
[null,null,"TEXTE() - Convertir une valeur numérique en texte formaté",null,null,null,null,null,"2009-09-29",79344]
[null,null,"DROITE() - GAUCHE() : Extraire les premiers ou derniers caractères d'une chaîne.",null,null,null,null,null,"2009-09-12",145176]
[null,null,"MAJUSCULE() - MINUSCULE() - NOMPROPRE(): Modifier la casse d'un texte",null,null,null,null,null,"2009-08-23",7657]
[null,null,"CNUM() - Convertir une chaîne en valeur numérique",null,null,null,null,null,"2009-08-19",45164]
[null,null,"DATEDIF() : Calculer la différence entre deux dates",null,null,null,null,null,"2009-07-26",105218]
[null,null,"Nommer une Plage Dynamique",null,null,null,null,null,"2008-12-06",59780]
[null,null,"Nommer une Plage de Cellules",null,null,null,null,null,"2008-12-05",75563]
[null,null,"Références Relatives & Absolues",null,null,null,null,null,"2008-12-05",15781]
[null,null,"Formule pour Nombres Premiers"]
[]
[null,null,"UN EXEMPLE DE GRAPHIQUE - cliquez dessus pour le modifier"]
[]
[]
[]
[]
[]
[]
[]
[]
[]
[]
[]
[]
[1,"TABLEAUX  DIVERS A COPIER / COLLER DANS VOS DOCUMENTS"]
[null,"Certains tableaux ont à peu près les mêmes fonctions pour vous laisser le libre choix  en fonction de votre utilisation"]
[]
[null,"LIENS INTERNET POUR RECHERCHE DE FORMULES"]
[null,"http://matoumatheux.ac-rennes.fr/sommaire.php?niv=6",null,null,null,null,"Le sirop de menthe",null,null,null,"Le gâteau de riz",null,null,null,"Les rubans"]
[null,"http://matoumatheux.ac-rennes.fr/admin/capture/chargement.htm",null,null,null,null,"Le cocktail mi-raisin",null,null,null,"Le far breton",null,null,null,"L'aire d'un disque"]
[null,"http://matoumatheux.ac-rennes.fr/accueil.htm",null,null,null,null,"Le cocktail verger",null,null,null,"La boulangerie",null,null,null,"Le rayon d'un disque"]
[null,"http://matoumatheux.ac-rennes.fr/divers/general/accueil.htm",null,null,null,null,"Le cocktail banane",null,null,null,"http://matoumatheux.ac-rennes.fr/geom/unite/accueil6.htm",null,null,null,"L'aire d'une couronne"]
[null,"http://matoumatheux.ac-rennes.fr/divers/liens/liens.htm",null,null,null,null," Le cocktail rouge",null,null,null,null,null,null,null,"L'aire latérale d'un cylindre"]
[null,"La multiplication avec les doigts",null,null,null,null,"Le sirop de menthe",null,null,null,"Conversions d'unités de longueur",null,null,null,"Le volume d'un cylindre"]
[null,"Classer des questions",null,null,null,null,"Rectangle ou disque",null,null,null,"Conversion d'unités de masse",null,null,null,"Le volume d'un cylindre"]
[null,"Les seringues",null,null,null,null,"Segment",null,null,null,"Attaché à un piquet",null,null,null,"Le mille-feuille"]
[null,"Les étiquettes",null,null,null,null,"Colorier un poisson",null,null,null,"Attaché à un piquet (1)",null,null,null,"L'aire d'un rectangle"]
[null,"Le verre mesureur",null,null,null,null,"La crème pâtissière",null,null,null,"Le chien fait le tour de son domaine",null,null,null,"Le gâteau"]
[null,null,null,null,null,null,null,null,null,null,null,null,null,null,"La casserole"]
[]
[null,null,null,null,null,null,"177 vidéos dans cette partie"]
[null,"http://webtv.ac-versailles.fr/restauration/Patisserie",null,null,null,null,"http://webtv.ac-versailles.fr/restauration/Patisserie",null,null,null,"http://chefsimon.lemonde.fr/recettes/tag/dessert",null,null,null,"https://www.google.fr/webhp?sourceid=chrome-instant&ion=1&espv=2&ie=UTF-8#q=RECETTES+PATISSERIE"]
[]
[]
[null,"Vous recherchez un décor  >",null,null,"cake design",null,"wedding cake photos",null,null,"wedding cake youtube",null,null,"FAIRE UN GÂTEAU VÉGÉTAL AVEC LES FLEURS DU JARDIN"]
[]
[]
[]
["ICI","Différentes formules pour calculer l'Aire ou surface du cercle",null,null,null,null,null,null,"CONVERSIONS"]
["Différentes formules pour calculer l'Aire ou surface du cercle",null,null,null,null,null,null,null,"1m2 = 10.000 cm2 ",null,null,"1 cm = 0,01 m donc "]
[null,null,null,null,null,null,null,null,"ou ",null,null,"1 cm² = 0,01 x 0,01 = 0,0001 m² = 10^-4 m² "]
[null,"❶","PI()*(Rayon^2)",null,null,null,null,null,"1cm2=1/10.000 m2"]
[null,"❷","PI()*(Rayon*Rayon)",null,null,null,null,null,"1cm^2=0.0001m^2",null,null,"Pour passer de m² en cm² il faut faire l'inverse "]
[null,"❸","PI()*(Diamètre/2)*(Diamètre/2)",null,null,null,null,null,"17 cm²=0.0017 m². ",null,null,"1 m = 100 cm "]
[null,null,null,null,null,null,null,null,null,null,null,"1 m² = 100 x 100 = 10 000 cm²"]
[]
[null,"Différentes formules pour calculer le volume d'un entremet",null,null,null,null,null,null,"10 000 cm2 = 100 dm2 = 1 m2 ",null,null,"copier/coller"]
[null,null,null,null,null,null,null,null,"1 cm2 = 0.001 dm2 = 0.00001 m2",null,null,0,0,0,0]
[null,"❶","((PI()*(Rayon^2)*Hauteur))"]
[null,"❷","(PI()*(Rayon*Rayon)*Hauteur)"]
[null,"❸","((Diamètre/2)*(Diamètre/2)*3.1416)*Hauteur",null,null,null,null,null,"Nombre de parts et poids d'une portion"]
[null,null,null,null,null,null,null,null,"Poids Total",8.35,"poids d'1 portion",null,0.25,{"$f":"IF(ISBLANK(M257),I260,M257)","v":33.4},"parts"]
[null,"L'aire d'un cercle de 22cm est égale à 3,14 x (11x11) = 379,94 cm2",null,null,null,{"$f":"3.14*(11*11)","v":379.94}]
[null,"L'aire d'un cercle de 22cm est égale à PI() x (11x11) = 380.13 cm2",null,null,null,"PI()*(11*11)",null,null,null,null,"Nb de parts",null,70,{"$f":"J256/M258","v":0.11928571428571429},"la portion"]
[null,"Nb de cercles","Diamètre",null,"rayon","Aire ou Surface"]
[null,1,22,null,{"$f":"C260/2","v":11},{"$f":"PI()*(E260^2)","v":380.13271108436498},null,null,{"$f":"IF(ISBLANK(M256),0,J256/M256)","v":33.4}]
[null,null,null,null,null,null,null,null,"Saisissez les valeurs dans les cellules fond jaune encre rouge "]
[null,null,null,null,null,null,null,null,"Adaptation : Joël Leboucher..UPRT \"Union des Personnels de la Restauration Territoriale\"  membre du réseau RESTAU'CO"]
[null,1,22,null,{"$f":"C263/2","v":11},{"$f":"PI()*(E263^2)","v":380.13271108436498}]
[]
[null,"Pour intégrer ce tableau sous des documents Modèle B3-B -2015 réduisez la largeur des colonnes à 9",null,null,null,null,null,null,"Transférer  des cercles dans des cadres"]
[null,"Sinon : Pour une meilleure lisibilité vous pouvez élargir les colonnes à 15 -ou Affichage Zoom 125%"]
[null,"Adaptation : Joël Leboucher..UPRT \"Union des Personnels de la Restauration Territoriale\"  membre du réseau RESTAU'CO",null,null,null,null,null,null,"CERCLES A TRANSFÉRER"]
[]
[null,null,null,null,null,null,null,null,"Nb de cercles","Diamètre","rayon","Poids crème liquide","Volume","Coeff."]
["ICI","Gastro Norm"]
["Gastro Norm","https://fr.wikipedia.org/wiki/Gastro_Norm",null,null,null,null,null,null,1,22,{"$f":"J271/2","v":11},0.15,{"$f":"(PI()*(K271^2)*I271)","v":380.13271108436498},{"$f":"N275","v":1.5783961298369786}]
[]
[null,"Le format de base est le GN 1/1, qui fait 530 x 325 mm. Les autres sont des multiples ou des sous-multiples de ce module de base. Les formats généralement rencontrés chez les professionnels sont1 :",null,null,null,null,null,null,"dans des moules et caisses rectangles"]
[]
[null,null,null,null,null,null,null,null,1,30,20,{"$f":"(L271*N271)*I271","v":0.2367594194755468},{"$f":"(J275*K275)*I275","v":600},{"$f":"M275/M271","v":1.5783961298369786}]
[]
[null,null,null,null,null,null,null,null,"Nb de moules","Longueur","Largeur","Poids crème liquide","Volume","Coeff."]
[]
[null,null,null,null,null,null,null,null,"Saisissez vos valeurs dans les cellules fond jaune encre rouge"]
[null,null,null,null,null,null,null,null,"Lien Auteur:","http://www.cestmafournee.com/2013/06/quelles-quantites-pour-mon-moule.html"]
[null,null,null,null,null,null,null,null,"Adaptation : Joël Leboucher..UPRT \"Union des Personnels de la Restauration Territoriale\"  membre du réseau RESTAU'CO"]
[]
[]
[null,null,null,null,null,null,null,null,"Différentes formules pour calculer le volume d'un cylindre (cercle à tarte)"]
[]
[]
[null,"Les profondeurs les plus courantes sont 20, 40, 65, 100, 150 et 200 mm.",null,null,null,null,null,null,"Nb de cercles","Diamètre","rayon","Hauteur","Volume"]
[]
[null,null,null,null,null,null,null,null,1,22,{"$f":"J289/2","v":11},1,{"$f":"((PI()*(K289^2)*L289))*I289","v":380.13271108436498}]
[]
[null,"Calculez le volume des moules et cadres rectangles",null,null,null,null,null,null,"Nb de cercles","Diamètre","Hauteur",null,"Volume"]
[]
[null,"Nb de moules","Longueur","Largeur","Hauteur","Volume",null,null,1,22,1,null,{"$f":"(((J293/2)*(J293/2)*3.1416)*K293)*I293","v":380.1336}]
[]
[null,1,30,20,1,{"$f":"((C295*D295)*E295)*B295","v":600},null,null,"Nb de cercles","Diamètre","Hauteur","Nb de parts","Volume"]
[]
[null,"Saisissez vos valeurs dans les cellules fond jaune encre rouge",null,null,null,null,null,null,1,22,1,3,{"$f":"(((J297/2)*(J297/2)*PI()*K297)*I297)/L297","v":126.71090369478833}]
[null,"Adaptation : Joël Leboucher..UPRT \"Union des Personnels de la Restauration Territoriale\"  membre du réseau RESTAU'CO"]
[null,null,null,null,null,null,null,null,"Saisissez vos valeurs dans les cellules fond jaune encre rouge"]
[null,null,null,null,null,null,null,null,"Adaptation : Joël Leboucher..UPRT \"Union des Personnels de la Restauration Territoriale\"  membre du réseau RESTAU'CO"]
[]
[]
[null,"Quel poids de pâte ou de liquide faut-il dans un ou des cercle (s)"]
[]
[null,"QUE VOULEZ VOUS FAIRE"]
[null,null,"Nb de cercles",null,"Diamètre",null,"Hauteur",null,"Poids de pâte ou liquide en Kg",null,"Volume"]
[null,"❶",1,null,26,null,4,null,{"$f":"(I311/K311)*K307","v":0.47499999999999998},null,{"$f":"(((E307/2)*(E307/2)*PI())*G307)*C307","v":2123.7166338267002}]
[]
[]
[null,"VALEURS DE RÉFÉRENCE "]
[null,"❷",1,null,26,null,4,null,0.47499999999999998,null,{"$f":"(((E311/2)*(E311/2)*PI())*G311)*C311","v":2123.7166338267002}]
[]
[null,"Encre bleue valeurs de base - encre rouge vos besoins"]
[null,"❶","Saisissez votre diamètre -le nombre de cercles à faire et la hauteur sur cette ligne"]
[null,"❷","Valeurs de référence pour un fond de tarte standard de 26 cm..j'ai pris pour exemple une tarte classique  comme base de calculs pour ce tableau. Vous pouvez saisir sur cette ligne des valeurs qui correspondent à votre échantillon ou votre modèle standard"]
[]
[]
[null,"Pâte brisée sucrée",null,null,null,null,null,null,"Poids",{"$f":"SUM(D319:D320,G319:G320,J319:J320)","v":0.47500000000000003}]
[null,"farine",null,0.25,"sel",null,5.0000000000000001E-3,"sucre semoule",null,2.5000000000000001E-2]
[null,"beurre",null,0.125,"œuf (1 jaune)",null,0.02,"eau",null,0.05]
[null,"Adaptation : Joël Leboucher..UPRT \"Union des Personnels de la Restauration Territoriale\"  membre du réseau RESTAU'CO"]
[]
[]
[null,"POIDS DE PATE NECESSAIRE POUR FONCER DES CADRES OU DES BACS GATRO (ici en référence : bacs gastro 1/1 pour Exemple)"]
[]
[]
[null,null,"NE PAS CONFONDRE CADRES ET CERCLES"]
[null,null,"Saisissez vos proportions cellules jaunes encre rouge"]
[null,null,"Combien de cadres voulez vous faire - passe au bleu si supérieur à 1 cadre pour attirer votre attention"]
[]
[null,null,null,"QUE VOULEZ VOUS FAIRE"]
[null,null,"Nb de cadres/bacs","Largeur en cm","Longueur en cm","Hauteur en cm","Epaisseur de l'abaisse en millimètre","hauteur de crête en millimètre","largeur de \"rognures\" en millimètre",null,null,"Poids de pâte prévu ","Avec votre poids de pâte"]
[]
[]
[null,null,"q","q","q","q","q","q","q"]
[null,null,1,32.5,53,2.5,2.5,5,5,null,null,{"$f":"(L343/M348)*M340","v":1.7392499999999997},{"$f":"(M345/M348)*M340","v":1.75}]
[]
[null,null,"❶","❷","❸","❼","❹","❺","❻",null,null,"❽","❾"]
[null,null,{"$f":"(D336*E336)*C336","v":1722.5},{"$f":"((D336*F336)*2)*C336+((E336*F336)*2)*C336","v":427.5},{"$f":"((D336*H339)*2)*C336+((E336*H339)*2)*C336","v":85.5},{"$f":"((D336*I339)*2)*C336+((E336*I339)*2)*C336","v":85.5},{"$f":"G336/10","v":0.25},{"$f":"H336/10","v":0.5},{"$f":"I336/10","v":0.5},null,null,{"$f":"SUM(C339:F339)","v":2321},{"$f":"(C339*F336)/1000","v":4.3062500000000004}]
[null,null,null,null,null,null,null,null,"Volume de pâte avec vos données",null,null,"❿",{"$f":"L339*G339","v":580.25}]
[null,null,null,"VALEURS DE RÉFÉRENCE "]
[null,null,"Si vous n'êtes pas d'accord avec le poids prévu pour 4 bacs gastro - Saisissez votre poids de pâte",null,null,null,null,null,null,null,null,null,"q"]
[null,null,4,32.5,53,2.5,2.5,5,5,null,null,{"$f":"E359","v":6.956999999999999},7]
[]
[null,null,{"$f":"ROW()-2","v":343},"Valeurs de référence fond gris encre bleue",null,null,null,null,null,null,null,null,{"$f":"IF(ISBLANK(M343),L343,M343)","v":7}]
[null,null,"❶","❷","❸","❼","❹","❺","❻",null,null,"❽","❾"]
[null,null,{"$f":"(D343*E343)*C343","v":6890},{"$f":"((D343*F343)*2)*C343+((E343*F343)*2)*C343","v":1710},{"$f":"((D343*H347)*2)*C343+((E343*H347)*2)*C343","v":342},{"$f":"((D343*I347)*2)*C343+((E343*I347)*2)*C343","v":342},{"$f":"G343/10","v":0.25},{"$f":"H343/10","v":0.5},{"$f":"I343/10","v":0.5},null,null,{"$f":"SUM(C347:F347)","v":9284},{"$f":"(C347*F343)/1000","v":17.225000000000001}]
[null,null,null,null,null,null,null,null,"Volume de pâte de Référence",null,null,"❿",{"$f":"L347*G347","v":2321}]
[]
[null,null,"❶","Surface du fond des cadres",null,"❺","Epaisseur de l'abaisse en cm",null,"❾","Volume des cadres/bacs en litres"]
[null,null,"❷","Surface de la hauteur des cadres",null,"❻","largeur de crête en cm"]
[null,null,"❸","surface de crête",null,"❼","largeur de \"rognures\" en cm",null,"❿","Volume de pâte en cm³ "]
[null,null,"❹","surface de \"rognures\"",null,"❽","Surface de pâte"]
[]
[null,null,null,"RÉFÉRENCE "]
[null,null,"Référence bac GN 1/1 perforés - largeur 325mm (32cm) - longueur 530 mm (53cm) - H25mm (2.5cm) tarte au citron pour 100 \"La cuisine de Collectivité\" page294 -Michel Grossmann et Alain Le franc - Edt.BPI  2006 - Poids de pâte sablée pour 4 bacs gastro"]
[]
[]
[null,null,null,"Pâte sablée",{"$f":"SUM(E360:E362,I360:I362)","v":6.956999999999999}]
[null,null,null,"farine",3.5,null,null,"œufs liquides 0.5L",0.55000000000000004]
[null,null,null,"beurre",1.6,null,null,"levure chimique",4.4999999999999998E-2]
[null,null,null,"sucre semoule ",1.25,null,null,"sel fin",1.2E-2]
[null,null,"Le poids de l’oeuf"]
[null,null,"En pâtisserie les ingrédients se mesure à l’unité ou au poids pour les recettes professionnnelles. Les oeufs font environ 55g"]
[]
[null,null,"1 jaune d’oeuf pèse envrion : 20g  – 1 blanc d’oeuf pèse environ : 30g – 1 coquille 5g"]
[null,null,"Equivalences en litre - 1 litre = environ"]
[null,null,"20 oeufs entiers (x 55g =1.100Kg)",null,null,"ou 50 jaunes (x 20g = 1Kg)",null,"ou 32 blancs (x 30g = 0.960Kg)"]
[null,null,"Lien internet","http://www.mylittlerecettes.com/cap-patissier-les-oeufs-en-patisserie/"]
[]
[null,null,"Adaptation : Joël Leboucher..UPRT \"Union des Personnels de la Restauration Territoriale\"  membre du réseau RESTAU'CO"]
[]
[]
[null,"FORMAT DE CELLULES CARRÉES"]
[null,"forum.excel-pratique.com/excel/donner-la-forme-de-carres-reguliers-a-toutes-les-cellules"]
[null,"Je voudrais que toutes les cellules de la feuille aient la forme de 'carrés'. Comment régler la largeur et la hauteur des cellules pour constituer des carrés ? Autrement dit y-a-t-il un rapport à observer entre les valeurs à donner aux largeurs et hauteurs des cellules? "]
[]
[null,"méthode bidouillage : "]
[null,"Les lignes doivent être environ 5.51 fois plus hautes que les colonnes ",null,null,null,null,"5.694 "]
[null,"donc sélectionne toutes tes colonnes que tu veux homogénéiser, et fait clic droit dans l'en-tete des colonnes / largeur de colonne. Là tu mets la valeur que tu veux. "]
[]
[null,"puis tu sélectionnes toutes tes lignes que tu veux, clic droit dans l'en-tête des lignes/ hauteur de ligne, et là tu mets ta valeur précédente x 5,51. "]
[]
[null,"largeur colonne",null,9.86,"multiplicateur",5.694,"hauteur de ligne",{"$f":"D384*F384","v":56.14284},"valeur",{"$f":"H384","v":56.14284}]
[]
[null,null,"Je me suis interrogé comment vous faisiez pour être si précis, je suppose que ce n'est à l'oeil ? "]
[null,null,"Je comprends qu'il n'y a pas de possibilité de décider : "]
[null,null,"de l'unité de mesure des largeurs et hauteurs, "]
[null,null,"du nombre d'unités."]
[null,"En fait je dessine un carré avec l'outil dessin (en enfoncant la touche Shift), puis je fait concorder exactement les traits de ligne et colonne sur le carré. Enfin, je regarde les largeur et hauteur que celà me donne, et je divise le plus grand par le plus petit. Voilà! "]
[]
[]
[null,"Je viens à nouveau de vérifier en faisant vraiment un grand carré, et le ratio est de 5,3 (ne pas mettre trop de virgule, en fait ça ne sert à rien). "]
[]
[null,null,"Pour les lignes, un pixel = 0.75 "]
[null,null,"pour les colonne, un pixel = 0.08 "]
[]
[null,null,"Pour t'aider un peu plus, a peu près : "]
[null,null,"Pour un carré de 1cm sur 1 cm, il faut "]
[null,null,"28.35 en hauteur de ligne "]
[null,null,"5.35 en largeur de colonne. "]
[null,"Après, celà va dépendre de comment tu imprimes, tes ajustements sur ta feuille, la taille de ton carré à de grandes chances de ne pas être de 1cm de coté. "]
[]
[null,"http://forum.excel-pratique.com/excel/donner-la-forme-de-carres-reguliers-a-toutes-les-cellules-t9229.html"]
[]
[]
[]
[]
[]
[null,"conversion : volume / poids",null,null,null,null,null,null,"conversion : volume / poids"]
[null,"Volume",null,"produit","densité","Poids",null,null,"Volume",null,"produit","densité","Poids"]
[null,20,{"$f":"B412/100","v":0.2},"Eau",1,{"$f":"(B412*E412)*10","v":200},{"$f":"F412/1000","v":0.2},null,10,{"$f":"I412/10","v":1},"Eau",1,{"$f":"(I412*L412)*100","v":1000},{"$f":"M412/1000","v":1}]
[null,null,null,"lait entier",1.03,{"$f":"(B412*E413)*10","v":206},{"$f":"F413/1000","v":0.20599999999999999},null,null,null,"lait entier",1.03,{"$f":"(I412*L413)*100","v":1030},{"$f":"M413/1000","v":1.03}]
[null,null,null,"lait 1/2 écrémé",1.0149999999999999,{"$f":"(E414*B412)*10","v":202.99999999999997},{"$f":"F414/1000","v":0.20299999999999996},null,null,null,"lait 1/2 écrémé",1.0149999999999999,{"$f":"(L414*I412)*100","v":1014.9999999999999},{"$f":"M414/1000","v":1.0149999999999999}]
[null,null,null,"huile",0.92,{"$f":"(E415*B412)*10","v":184.00000000000003},{"$f":"F415/1000","v":0.18400000000000002},null,null,null,"huile",0.92,{"$f":"(L415*I412)*100","v":920.00000000000011},{"$f":"M415/1000","v":0.92000000000000015}]
[null,null,null,"alcool",0.8,{"$f":"(E416*B412)*10","v":160},{"$f":"F416/1000","v":0.16},null,null,null,"alcool",0.8,{"$f":"(L416*I412)*100","v":800},{"$f":"M416/1000","v":0.8}]
[]
[]
[]
[]
[null,null,null,null,null,"Aide mémoire sur la base eau : 1L = 1Kg - 1 gr = 0.001Kg  > 2 zéros après la virgule du Kg ",null,null,null,null,"Aide mémoire sur la base eau : 1L = 1Kg - 1 gr = 0.001Kg  > 2 zéros après la virgule du Kg "]
[]
[null,null,null,null,null,"Kg","hg","dag","gr",null,"3 cl = 30g = 0.03kg    /    30 cl = 300g = 0.3kg     /     3 dl = 300g = 0.3 kg"]
[null,null,null,null,null,"Saisissez votre volume",null,null,null,null,"sur la base eau : 1L = 1Kg "]
[null,null,null,null,null,"L","dl","cl","ml",null,"Litres (l.) ","Centilitres (cl.) ","Décilitres (dl.) ","Kilogrammes (kg.) "]
[null,null,null,null,null,1,{"$f":"F426*10","v":10},{"$f":"G426*10","v":100},{"$f":"H426*10","v":1000}]
[null,null,null,null,null,{"$f":"G427/10","v":0.1},1,{"$f":"G427*10","v":10},{"$f":"G427*100","v":100},null,"1litre","100 cl","10 dl","1 kg"]
[null,null,null,null,null,{"$f":"G428/10","v":0.01},0.1,1,{"$f":"G428*100","v":10},null,"1/2 litre","50 cl","5 dl","0,500 kg"]
[null,null,null,null,null,{"$f":"I429/1000","v":1E-3},{"$f":"I429/100","v":0.01},{"$f":"I429/10","v":0.1},1,null,"1/4 litre","25 cl","2,5 dl","0,250 kg"]
[null,null,null,null,null,"3 cl = 30g = 0.03kg    /    30 cl = 300g = 0.3kg     /     3 dl = 300g = 0.3 kg",null,null,null,null,"1/8 litre","12, 5 c","1,25 dl","0,125 kg"]
[null,null,null,null,null,"http://www.cuisinealafrancaise.com/fr/2-poids-et-mesures",null,null,null,null,"http://www.cuisinealafrancaise.com/fr/2-poids-et-mesures"]
[]
[]
[null,"lien >","l'huile = 0,920 Kg/L",null,null,null,null,null,null,null,"Convertir des temps"]
[null,null,null,null,null,null,null,null,null,null,"Heures","Minutes","Centièmes"]
[null,"Alcool = 0,800 Kg/L",null,null,null,null,null,null,null,null,4.1666666666666664E-2,60,100]
[null,"eau salée nature = 1,130 Kg/L en fonction du sel ajouté",null,null,null,null,null,null,null,null,4.1666666666666664E-2,{"$f":"(L436/K436)*K437","v":60},{"$f":"(M436/K436)*K437","v":100}]
[null,"lien >","densité des liquides pour cocktails",null,null,null,null,null,null,null,{"$f":"(K436/L436)*L438","v":6.2499999999999993E-2},90,{"$f":"(M436/L436)*L438","v":150}]
[null,null,null,null,null,null,null,null,null,null,{"$f":"(K436/M436)*M439","v":1.6666666666666666E-2},{"$f":"(L436/M436)*M439","v":24},40]
[]
[]
[]
[null,"LIAISON AU TAPIOCA",null,null,null,null,null,null,"SERVICE DES SAUCES",null,"Plat mode de cuisson",null,"Grammages sauce p.p.","1 Kg pour :"]
[]
[null,"POUR 1 LITRE DE SAUCE TERMINÉE",null,null,null,null,null,null,"Sans sauce",null,"grillé,frit,nature"]
[null,null,null,null,null,null,null,null,"Déglaçage",null,"roti,poélé",null,"20/30 g","33 à 50 p."]
[null,"30 gr","pour lier 1L de soupe à l'oignon ",null,null,null,null,null,"Sauce courte",null,"pièces sautées",null,"40/50 g","20 à 25 p."]
[null,"30 gr","pour lier 200g de chair à saucisse pour tomates farcies ",null,null,null,null,null,"Sauce longue",null,"ragoûts,braisés",null,"60/80 g","12 à 16 p."]
[null,"30 gr","pour lier 1Kg de tomates concassées avec jus ",null,null,null,null,null,"Bouillon",null,"pochés,plats complets",null,"90/150 g","6 à 11 p."]
[null,"40 gr","pour quiche avec 2 œufs"]
[null,"50 gr","sauce bien liée épaisse"]
[null,"60 gr","plus 8 œufs pour crème patissière"]
[null,"60 gr","un velouté ou une sauce veloutée"]
[null,"70/80 gr","béchamelle gluante, solidification à froid, donc épaississement important lors de la chute en température"]
[]
[null,"90 gr","pour lier 1L de lait pour gratin d'épinards avec 4 œufs et 120g de gruyère"]
[]
[]
[null,"Quantités nettes à prévoir : Mater Prim Adul Adul +  ",null,null,null,null,null,"PURÉE DÉSHYDRATÉE"]
[null,"Grammages nets",null,"Quantité Totale ",{"$f":"(B462*B465)+(C462*C465)+(D462*D465)+(E462*E465)","v":228.85000000000002},null,null,"Purée déshydratée","Eau","Lait déshydraté","Lait frais","Crème fraiche","Beurre","Poids reconstitué"]
[null,null,null,null,null,null,null,0.12,1,0.11,0,0.01,5.0000000000000001E-3,{"$f":"SUM(H461:M461)","v":1.2450000000000001}]
[null,6.5000000000000002E-2,7.4999999999999997E-2,0.12,0.15]
[null,null,null,null,null,null,null,{"$f":"(H461/N461)*N463","v":2.1204819277108431},{"$f":"(I461/N461)*N463","v":17.670682730923691},{"$f":"(J461/N461)*N463","v":1.9437751004016062},{"$f":"(K461/N461)*N463","v":0},{"$f":"(L461/N461)*N463","v":0.17670682730923692},{"$f":"(M461/N461)*N463","v":8.8353413654618462E-2},22]
[null,"Maternelles","Primaires","Adultes ","Adultes +"]
[null,920,1700,240,85,null,null,"Poids à l'arrondi supérieur"]
[null,null,null,null,null,null,null,{"$f":"ROUNDUP(H463,2)","v":2.13},17.680000000000003,1.95,0,0.18000000000000002,0.09,{"$f":"SUM(H466:M466)","v":22.03}]
[null," Effectifs",{"$f":"SUM(B465:E465)","v":2945},"Parts Adultes",{"$f":"IF(E460=0,0,E460/D462)","v":1907.0833333333335}]
[null,null,null,null,null,null,null,"Saisissez vos valeurs dans les cellules fond ivoire ou jaune"]
[null,"Saisissez vos valeurs dans les cellules fond ivoire ou jaune"]
[]
[null,"AIDES A LA DÉCISION"]
[]
[]
["ICI",{"$f":"B475","v":"Gélatine alimentaire"}]
[{"$f":"B475","v":"Gélatine alimentaire"},"Gélatine alimentaire"]
[]
[null,"Mickaël Rabeau Formateur AFPA Rochefort sur mer 2016"]
[]
[null,null,null,null,null,null,null,null,null,null,null,null,null,"n'hésitez pas a cliquer sur les liens internet"]
[null,null,"Obtenue par hydrolyse du collagène contenu dans les peaux et os des animaux. Se vend en feuilles ou en poudre."]
[null,null,"Gélatine feuille"]
[null,null,"La gélatine gonfle dans l'eau froide, se dissout dans l'eau chaude et se prend en gelée en refroidissant."]
[null,null,"Emplois  : Sert à la préparation de certains entremets, pour la confection de gelées et la stabilisation des glaces. Pastillage."]
[null,null,"Une feuille pèse environ 2 g ou 2,5 g"]
[null,null,"Attention pour les pulpes de Kiwi, ananas, papaye : cuire les pulpes à 60°C pour détruire l'enzyme qu'elles contiennent."]
[null,null,"La gélatine prend 5-6 fois son poids en eau (10 g de gélatine et 50- 60 g d'eau)"]
[]
[null,null,"GELATINE en feuille"]
[null,null,null,null,null,"❶",null,"Liens internet 2013"]
[null,null,"❷","Feuille entière (1 =",null,2,null,"feuilles de gélatine - Le Salon du Blog Culinaire"]
[null,null,10,"feuilles",null,{"$f":"C491*F490","v":20},null,"Gélatine et agar-agar : principes et utilisations"]
[null,null,null,null,null,null,null,"Agar Agar"]
[null,null,null,null,null,null,null,"Glaçage brillant au chocolat - Fiche recette ... - Meilleur du Chef"]
[null,null,"❶","si vous n'êtes pas d'accord avec le poids d'une feuille - saisissez ce qui vous convient"]
[null,null,"❷","Combien de feuilles - à vous de saisir un nombre"]
[null,{"$f":"CELL(\"nomfichier\",A492)","v":"E:\\Joël Leboucher\\Téléchargements\\[GA-modele.de.fiche.pour.galettes.xlsm]Cuisiniers.Pesez"}]
[null,"Adaptation : Joël Leboucher..UPRT \"Union des Professionnels de la Restauration Territoriale\"  membre du réseau RESTAU'CO"]
[]
[]
["ICI",{"$f":"B501","v":"ŒUFS poids et %"}]
[{"$f":"B501","v":"ŒUFS poids et %"},"ŒUFS poids et %"]
[]
[null,"Police de couleur pour saisir vos valeurs    Noir = formules"]
[]
[null,"ŒUFS poids et %"]
[null,"❷",null,"❶",null,null,"❷",null,"❶",null,"❷",null,"❶"]
[null,"Œuf entier  ( 1 =",null,50,1,null,"Jaunes d'œufs ( 1 =",null,20,{"$f":"I507/D507","v":0.4},"Blancs d'œufs  ( 1 =",null,30,{"$f":"M507/D507","v":0.6}]
[null,4,"œufs =",{"$f":"B508*D507","v":200},"gr",null,10,"jaunes =",{"$f":"G508*I507","v":200},"gr",12,"blancs =",{"$f":"K508*M507","v":360},"gr"]
[null,"Poids","Protéines","M.Grasse","eau",null,"Poids","Protéines","M.Grasse","eau","Poids","Protéines","M.Grasse","eau"]
[null,{"$f":"D508","v":200},{"$f":"B510*C511","v":24.489795918367346},{"$f":"B510*D511","v":22.448979591836736},{"$f":"B510*E511","v":153.0612244897959},null,{"$f":"I508","v":200},{"$f":"G510*H511","v":34.4},{"$f":"G510*I511","v":64.600000000000009},{"$f":"G510*J511","v":101},{"$f":"M508","v":360},{"$f":"K510*L511","v":39.96},{"$f":"K510*M511","v":0},{"$f":"K510*N511","v":320}]
[null,{"$f":"C511+D511+E511","v":1},0.12244897959183673,0.11224489795918367,0.76530612244897955,null,{"$f":"H511+I511+J511","v":1},0.17199999999999999,0.32300000000000001,0.505,{"$f":"L511+M511+N511","v":0.99988888888888894},0.111,0,0.88888888888888895]
[null,null,"❶","❶","❶",null,null,"❶","❶","❶",null,"❶",null,"❶"]
[null,"❶","si vous n'êtes pas d'accord avec les grammages saisis - saisissez ce qui vous convient"]
[null,"❷","Combien d'œufs - de jaunes ou de blancs - à vous de saisir un nombre",null,null,null,null,null,null,null,null,null,null,"n'hésitez pas a cliquer sur les liens internet"]
[null,null,null,"Lien internet :","Œufs 101 - Introduction aux œufs » Lesoeufs.ca"]
[null,"Adaptation : Joël Leboucher..UPRT \"Union des Professionnels de la Restauration Territoriale\"  membre du réseau RESTAU'CO"]
[]
[]
[]
[]
[null,null,null,null,null,null,null,null,null,"Prix D'ACHAT / Prix de VENTE"]
[null,null,"PRIX D'ACHAT",0.44,null,"PRIX D'ACHAT",100,null,"PRIX VENTE",115]
[null,null,"%  d'augmentation",60,null,"Augmentation",10,null,"PRIX D'ACHAT",133]
[null,null,"Augmentation",{"$f":"D522*D523%","v":0.26400000000000001},null,"PRIX VENTE",{"$f":"IF(G522=0,0,G522+G523)","v":110},null,"Augmentation",{"$f":"IF(J522=0,0,IF(J523=0,0,J522-J523))","v":-18}]
[null,null,"PRIX VENTE",{"$f":"((D522*D523)/100)+D522","v":0.70399999999999996},null,"%  d'augmentation",{"$f":"IF(G522=0,0,IF(ISBLANK(G522),0,(G523/G522)*100))","v":10},null,"%  d'augmentation",{"$f":"IF(J523=0,0,IF(ISBLANK(J523),0,(J524/J523)*100))","v":-13.533834586466165}]
[]
[null,null,"PRIX D'ACHAT",5.8970000000000002,null,"PRIX VENTE",9.64,null,"PRIX VENTE",100]
[null,null,"PRIX VENTE",9.64,null,"%  d'augmentation",63.5,null,"Augmentation",50]
[null,null,"Augmentation",{"$f":"IF(D527=0,0,IF(D528=0,0,D528-D527))","v":3.7430000000000003},null,"Augmentation",{"$f":"G527-G530","v":3.7439755351681958},null,"PRIX D'ACHAT",{"$f":"IF(J527=0,0,IF(ISBLANK(J527),0,J527-J528))","v":50}]
[null,null,"%  d'augmentation",{"$f":"IF(D527=0,0,IF(ISBLANK(D527),0,(D529/D527)*100))","v":63.472952348651859},null,"PRIX D'ACHAT",{"$f":"(G527/(100+G528)*100)","v":5.8960244648318048},null,"%  d'augmentation",{"$f":"IF(J529=0,0,IF(ISBLANK(J528),0,(J528/J529)*100))","v":100}]
[null,"Saisissez vos valeurs dans les cellules fond ivoire ou jaune"]
[]
[]
[null,15,15,15,15,15,15,"largeur de colonnes",15,15,15,15,15,15,"largeur de colonnes"]
[null,"Aide à la décision en Gr",null,null,null,null,"Pourcentages NET / BRUT et BRUT / NET",null,"Aide à la décision en Kg",null,null,null,null,"Pourcentages NET / BRUT et BRUT / NET"]
[null,"POIDS NET",1000,"POIDS NET",1000,"POIDS NET",100,null,"POIDS NET",1,"POIDS NET",1,"POIDS NET",1]
[null,"POIDS BRUT",2000,"POIDS de PERTE",327,"%  de PERTE",40,null,"POIDS BRUT",2,"POIDS de PERTE",2,"%  de PERTE",50]
[null," Poids de perte",{"$f":"IF(C536=0,0,IF(C537=0,0,C537-C536))","v":1000},"Poids brut",{"$f":"IF(E536=0,0,E536+E537)","v":1327}," Poids de perte",{"$f":"G539*G537%","v":66.666666666666671},null," Poids de perte",{"$f":"IF(J536=0,0,IF(J537=0,0,J537-J536))","v":1},"Poids brut",{"$f":"IF(L536=0,0,L536+L537)","v":3}," Poids de perte",{"$f":"N539*N537%","v":1}]
[null,"%  de perte",{"$f":"IF(C536=0,0,IF(C537=0,0,C538/C537))","v":0.5},"%  de perte",{"$f":"IF(E536=0,0,E537/E538)","v":0.24642049736247174},"Poids brut",{"$f":"G536/(100-G537)*100","v":166.66666666666669},null,"%  de perte",{"$f":"IF(J536=0,0,IF(J537=0,0,J538/J537))","v":0.5},"%  de perte",{"$f":"IF(L536=0,0,L537/L538)","v":0.66666666666666663},"Poids brut",{"$f":"N536/(100-N537)*100","v":2}]
[null,"POIDS BRUT",1780,"POIDS BRUT",2310,"POIDS BRUT",500,null,"POIDS BRUT",2,"POIDS BRUT",2,"POIDS BRUT",1]
[null,"POIDS NET",1000,"POIDS de PERTE",720,"%  de PERTE",50,null,"POIDS NET",1,"POIDS de PERTE",1,"%  de PERTE",50]
[null," Poids de perte",{"$f":"IF(C540=0,0,IF(C541=0,0,C540-C541))","v":780},"Poids net",{"$f":"IF(E540=0,0,IF(E541=0,0,E540-E541))","v":1590}," Poids de perte",{"$f":"G540*G541%","v":250},null," Poids de perte",{"$f":"IF(J540=0,0,IF(J541=0,0,J540-J541))","v":1},"Poids net",{"$f":"IF(L540=0,0,IF(L541=0,0,L540-L541))","v":1}," Poids de perte",{"$f":"N540*N541%","v":0.5}]
[null,"%  de perte",{"$f":"IF(C540=0,0,C542/C540)","v":0.43820224719101125},"%  de perte",{"$f":"IF(E540=0,0,IF(E541=0,0,E541/E540))","v":0.31168831168831168},"Poids net",{"$f":"G540-G542","v":250},null,"%  de perte",{"$f":"IF(J540=0,0,J542/J540)","v":0.5},"%  de perte",{"$f":"IF(L540=0,0,IF(L541=0,0,L541/L540))","v":0.5},"Poids net",{"$f":"N540-N542","v":0.5}]
[null,"Saisissez vos valeurs dans les cellules fond ivoire ou jaune",null,null,null,null,null,null,"Saisissez vos valeurs dans les cellules fond ivoire ou jaune"]
[]
[]
[]
[]
[null,null,null,null,null,null,null,null,null,"A chacun d'utiliser le lien qui lui convient le mieux"]
[]
[null,null,null,null,null,null,null,null,null,"lien vidéo Youtube"]
[null,null,null,null,null,null,null,null,null,"Calculer un pourcentage - exemple"]
[null,null,null,null,null,null,null,null,null,null,"https://www.youtube.com/watch?v=mGDjvAcvigc"]
[null,null,null,null,null,null,null,null,null,null,"https://www.youtube.com/c/YMONKA"]
[null,null,null,null,null,null,null,null,null,null,"https://www.youtube.com/watch?v=tSp2xkS-tKs"]
[null,"https://www.maths-et-tiques.fr/telech/Pourcent.pdf",null,null,null,null,null,null,null,null,"https://www.youtube.com/watch?v=dWC54hCv0pc"]
[null,"http://www.maths-et-tiques.fr/index.php/cours-en-videos",null,null,null,null,null,null,null,null,"https://www.youtube.com/watch?v=psIZ0y_8VVc"]
[null,null,null,null,null,null,null,null,null,null,"https://www.youtube.com/watch?v=PyDvkMr3qfg"]
[null,"Poids brut ou poids net ? Ne payez pas l'emballage !",null,null,null,null,null,null,null,null,"https://www.youtube.com/watch?v=_PTjJ7UD4eo"]
[null,"https://www.economie.gouv.fr/files/files/directions_services/dgccrf/documentation/publications/depliants/poidsbrut_poidsnet.pdf"]
[]
[null,null,null,null,null,null,null,null,null,null,null,null,"Pour prendre 20% de 140"]
[null,"Valeur d'un pourcentage, calcul simplifié",null,null,null,null,"Pour prendre, par exemple, le 5 % de 87 Kg",null,null,null,null,null,"il suffit de multiplier 140 par 20 %"]
[null,"Pour prendre, par exemple, le 5 % de 87 Kg",null,null,"87-5%",null,null,null,null,"Pour prendre 20% de 140",null,null,"POIDS BRUT",140]
[null,"Au lieu de multiplier par 5, puis de diviser par 100,",null,null,null,null,"POIDS BRUT",87,null,"il suffit de multiplier 140 par 20 %",null,null,"%  de PERTE",20]
[null," il est plus simple de multiplier par ",null,null,null,null,"%  de PERTE",5,null,"c'est-à-dire faire : (140 * 20) / 100",null,null," Poids de perte",{"$f":"(N564*N565)/100","v":28}]
[null,"5 / 100 = 0.05, ",null,null,null,null,"coefficient",{"$f":"H566/100","v":0.05},null,"ou plus simplement : ",null,null,"coefficient",{"$f":"N565/100","v":0.2}]
[null,"opération qu'on peut réaliser mentalement.",null,null,null,null," Poids de perte",{"$f":"H565*H567","v":4.3500000000000005},null,"140 * 0.2(On obtient : 28)",null,null," Poids de perte",{"$f":"N564*N567","v":28}]
[null,"Le calcul se réduit maintenant à une seule opération arithmétique, a savoir",null,null,null,null,null,null,null,"Si on avait à trouver 40% de 140, ",null,null,"ou plus simplement : "]
[null,"(87 Kg) x 0.05 = 4.35 Kg",null,null,null,null,"Pour déduire, par exemple, le 5 % de 87 Kg",null,null,"on aurait multiplié 140 par 0.4",null,null,"140 * 0.2(On obtient : 28)"]
[null,null,null,null,null,null,null,null,null,"90% ? On multiplie 140 par 0.9",null,null,{"$f":"N567","v":0.2},{"$f":"N564*M571","v":28},"."]
[null,"Pour déduire, par exemple, le 5 % de 87 Kg",null,null,null,null,"POIDS BRUT",87,null,null,null,null,"Si on avait à trouver 40% de 140, "]
[null,"Commencer par un calcul oral: quand on déduit le",null,null,null,null,"%  de PERTE",5,null,null,null,null,"on aurait multiplié 140 par 0.4"]
[null," 5 %, il reste le 95 %     ( 100 - 5 )",null,null,null,null,"coefficient",{"$f":"(100-H573)/100","v":0.95},null,null,null,null,"%  de PERTE",40]
[null,"On peut alors calculer directement le résultat, à savoir: ",null,null,null,null,"Poids net",{"$f":"H572*H574","v":82.649999999999991},null,null,null,null,{"$f":"N574/100","v":0.4},{"$f":"N564*M575","v":56}]
[null,"(87 Kg) × 0.95 = 82.65 kg",null,null,null,null,null,null,null,null,null,null,"%  de PERTE",90]
[null,"Avec cette manière de faire, la calculatrice n'a été utilisée que pour une seule opération arithmétique : ",null,null,null,null,null,null,null,null,null,null,"90% ? On multiplie 140 par 0.9"]
[null,null,null,null,null,null,null,null,null,null,null,null,{"$f":"N576/100","v":0.9},{"$f":"N564*M578","v":126}]
[null,"Voici la formule pour calculer un pourcentage, ",null,null,null,null,"Voici la formule pour calculer un pourcentage, "]
[null,"par exemple 8% de 500 :"]
[null,"500 x (8/100) = 40",null,null,null,null,"par exemple 8% de 500 :"]
[null,"ou alors",null,null,null,null,"500 x (8/100) = 40"]
[null,"500 x 0.08 = 40",null,null,null,null,"POIDS BRUT",500]
[null,"0.08 = (8/100)",null,null,null,null,"%  de PERTE",8]
[null,null,null,null,null,null," Poids de perte",{"$f":"H583*(H584/100)","v":40}]
[null,null,null,null,null,null,"ou alors"]
[null,null,null,null,null,null,"500 x 0.08 = 40"]
[null,null,null,null,null,null,{"$f":"H584/100","v":0.08},{"$f":"H583*G588","v":40}]
[]
[]
[null,null,null,null,null,null,null,"Décriptage d'une recette par les pourcentages"]
[null,"Pourcentages",null,{"$f":"IF(B593<G593,\"Recette imcomplète,il manque\",IF(B593>G593,\"Trop de produits dans le recette\",IF(B593=G593,\"\")))","v":"Recette imcomplète,il manque"},{"$f":"IF(B593=G593,\"\",IF(B593<G593,G593-B593,IF(B593>G593,B593-G593)))","v":2.9999999999999916E-2},"NET","% Perte","BRUT"]
[null,{"$f":"SUM(B594:B599)","v":0.97000000000000008},null,null,"POIDS DE LA RECETTE A DÉCRYPTER",7,1,{"$f":"SUM(H594:H599)","v":6.9300000000000006}]
[null,0.12,"Rhum",null,null,{"$f":"F593*B594","v":0.84},0,{"$f":"IF(G594=0,F594,IF(F594=\"\",\"\",F594/(100-G594)*100))","v":0.84}]
[null,0.08,"Sucre de cannes",null,null,{"$f":"F593*B595","v":0.56000000000000005},0,0.56000000000000005]
[null,0.2,"Jus de pamplemousse",null,null,{"$f":"F593*B596","v":1.4000000000000001},0,1.4000000000000001]
[null,0.55000000000000004,"Jus d'orange",null,null,{"$f":"F593*B597","v":3.8500000000000005},0,3.8500000000000005]
[null,0.02,"Citron vert",null,null,{"$f":"F593*B598","v":0.14000000000000001},50,0.28000000000000003]
[null,null,null,null,null,{"$f":"F593*B599","v":0},0,0]
[]
[]
[]
[null,"Pourcentages : Calculer un pourcentage"]
[null,"https://www.mathematiquesfaciles.com/pourcentages-calculer-un-pourcentage_2_19885.htm",null,null,null,null,null,null,null,"wikipedia.org"]
[null,null,null,null,null,null,null,null,null,"https://fr.wikipedia.org/wiki/Pourcentage"]
[null,"Révisez, et entrainez vous."]
[null,"sans calculatrice...",null,null,null,null,null,null,null,"Comprendre les maths!"]
[null,"D.CATROU 2010",null,null,null,null,null,null,null,"Florent Gouachon"]
[null,"Lycée Jean Monnet…Juvisy - académie de Versailles",null,null,null,null,null,null,null,"Liam Dauchat"]
[null,"http://www.lyc-monnet-juvisy.ac-versailles.fr/Diapomath.pdf",null,null,null,null,null,null,null,"Besançon"]
[null,null,null,null,null,null,null,null,null,"https://www.cmath.fr/cesite/presentation.php"]
[null,"une multiplication, ce qui augmente la vitesse et réduit les occasions de se tromper.",null,null,null,null,null,null,null,"https://www.cmath.fr/6eme/pourcentages/cours.php"]
[null,"https://www.deleze.name/marcel/culture/taux_composes/taux_simple.html"]
[null,null,null,null,null,null,null,null,null,"Comment convertir en pourcentage"]
[null,null,null,null,null,null,null,null,null,"https://fr.wikihow.com/convertir-en-pourcentage"]
[null,"Comment compter le pourcentage de tête vite et facilement"]
[null,"http://calc.name/blog/comment-compter-le-pourcentage-de-tete-vite-et-facilement/",null,null,null,null,null,null,null,"fabie.info.pagesperso-orange"]
[null,"http://www.un-calcul.fr/calcul-comptabilite/comment-calculer-un-pourcentage-338",null,null,null,null,null,null,null,"http://fabie.info.pagesperso-orange.fr/math/cours7.htm"]
[]
[null,"Comment retrouver la valeur de départ ?",null,null,null,null,null,null,null,"Comment appliquer une augmentation en pourcentage ?"]
[null,"Les Maths ? Je capte pas ! Les chiffres ? J'y comprends rien ! Vous vous reconnaissez ?",null,null,null,null,null,null,null,"http://www.capte-les-maths.com/pourcentage/les_pourcentages_p6.php"]
[null,"Vous qui désespérez... Vous que les Maths n'intéressent pas... Et pourtant il faudrait..."]
[null,"Alors capte-les-maths.com est fait pour vous !",null,null,null,null,null,null,null,"Calculer un pourcentage avec Excel"]
[null,"http://www.capte-les-maths.com/pourcentage/les_pourcentages_p10.php",null,null,null,null,null,null,null,"http://fortimelp.fr/content/44-calculer-un-pourcentage"]
[null,null,null,null,null,null,null,null,null,"https://www.youtube.com/watch?v=dQafvb2O01U"]
[null,null,null,null,null,null,null,null,null,"https://www.youtube.com/watch?v=QTGvjmAhEHo"]
[null,"Comment calculer combien on va payer pendant les soldes?"]
[null,"http://www.slate.fr/story/82029/soldes-calculer-rabais",null,null,null,null,null,null,null,"mode d'emploi simple pour appliquer un pourcentage d'augmentation avec la Calculatrice de Windows."]
[null,null,null,null,null,null,null,null,null,"http://www.astuceshebdo.com/2012/03/comment-calculer-un-pourcentage-cas-n-1.html"]
[]
[]
[]
[]
[null,null,null,null,null,null,{"$f":"SUBSTITUTE(ADDRESS(1,COLUMN(),4),\"1\",\"\")","v":"G"},"j'ai volontairement ajouté cette colonne..si vous supprimez une ligne le tableau fonctionnera quand même"]
[null,null,"Composition d'une garniture \"COUSCOUS\""]
[null,null,"POIDS NET A FABRIQUER",null,null,1,{"$f":"F636","v":1},"Net cuit",null,"perte en cuisson","Poids brut à mettre en œuvre"]
[null,null,"carottes coupées",null,null,25,{"$f":"G636","v":1},{"$f":"(G637*F637)/100","v":0.25},null,20,{"$f":"H637/(100-J637)*100","v":0.3125}]
[null,null,"courgettescoupées",null,null,20,{"$f":"G636","v":1},0.2,null,25,0.26666666666666672]
[null,null,"navets coupé",null,null,15,{"$f":"G636","v":1},0.15,null,20,0.1875]
[null,null,"pois chiches pré-cuits",null,null,15,{"$f":"G636","v":1},0.15,null,0,0.15]
[null,null,"garniture de céléri branche",null,null,10,{"$f":"G636","v":1},0.1,null,20,0.125]
[null,null,"poivrons rouges coupés",null,null,7.5,{"$f":"G636","v":1},7.4999999999999997E-2,null,20,9.375E-2]
[null,null,"poivrons verts coupés",null,null,7.5,{"$f":"G636","v":1},7.4999999999999997E-2,null,20,9.375E-2]
[null,null,"Total",null,null,{"$f":"SUM(F637:F643)","v":100}]
[]
[]
[]
[null,null,"COMPOSITION ET SERVICE D'UN PLAT COMPLET"]
[null,null,"Veullez saisir les informations dans les cellules fond de couleur ivoire. "]
[null,null,"SERVICE EN FONCTION DES EFFECTIFS"]
[null,null,{"$f":"CELL(\"nomfichier\")","v":"E:\\0-UPRT\\1-UPRT.FR-SITE-WEB\\re-recettes-jean-marc-catteau\\re-catteau-galettes\\[GA-pate.sud.finistere.xlsm]Modes.d'emploi"}]
[null,null,"COUSCOUS"]
[null,null,null,null,"Document édité le :",null,{"$f":"TODAY()","v":"2021-12-20"},null,null,{"$f":"NOW()","v":44550.819123148147}]
[null,null,1,"Effectifs  à saisir"]
[null,null,null,"Famille de convives",null,null,null,"Mater","Prim","Adultes","Adultes +","Ainés"]
[null,null,null,"Total Effectifs",null,null,{"$f":"SUM(H656:L656)","v":2170},550,920,340,150,210]
[]
[null,null,2,"grammages ou nombre de Morceaux ou tranches à saisir"]
[null,null,null,"haut de cuisse de poulet",null,null,{"$f":"(H659*H656)+(I659*I656)+(J659*J656)+(K659*K656)+(L659*L656)","v":1470},0,1,1,0,1]
[null,null,null,"pilon de poulet",null,null,{"$f":"(H660*H656)+(I660*I656)+(J660*J656)+(K660*K656)+(L660*L656)","v":850},1,0,0,2,0]
[null,null,null,"merguez",null,null,{"$f":"(H661*H656)+(I661*I656)+(J661*J656)+(K661*K656)+(L661*L656)","v":1895},0.5,1,1,1,1]
[null,null,null,"Agneau en morceaux",null,null,{"$f":"(H662*H656)+(I662*I656)+(J662*J656)+(K662*K656)+(L662*L656)","v":1190},0,0,2,2,1]
[null,null,null,"Agneau boulettes",null,null,{"$f":"(H663*H656)+(I663*I656)+(J663*J656)+(K663*K656)+(L663*L656)","v":2540},1,2,0,1,0]
[null,null,null,null,null,null,null,"Mater","Prim","Adultes","Adultes +","Ainés"]
[null,null,null,null,null,null,"Total Mx par convive",{"$f":"SUM(H659:H664)","v":2.5},{"$f":"SUM(I659:I664)","v":4},{"$f":"SUM(J659:J664)","v":4},{"$f":"SUM(K659:K664)","v":6},{"$f":"SUM(L659:L664)","v":3}]
[]
[null,null,3,"légumes couscous cuits",null,null,{"$f":"(H667*H656)+(I667*I656)+(J667*J656)+(K667*K656)+(L667*L656)","v":208.60000000000002},0.06,0.08,0.15,0.2,0.1]
[]
[null,null,4,"Semoule cuite",null,null,{"$f":"(H669*H656)+(I669*I656)+(J669*J656)+(K669*K656)+(L669*L656)","v":213.5},0.06,0.1,0.12,0.15,0.12]
[]
[null,null,5,"Bouillon",null,null,{"$f":"(H671*H656)+(I671*I656)+(J671*J656)+(K671*K656)+(L671*L656)","v":237.5},0.06,0.1,0.15,0.2,0.15]
[]
[]
[]
[]
[null,null,"Comment respecter un grammage à servir Exemple N° 1"]
[null,null,"Police de couleur pour saisir vos valeurs    Noir ou gris = formules"]
[null,null,"Les quantités consommées par les enfants dépendent :de l'âge, de la saison, du goût, de l'influence des camarades,de l'activité phisique et/ou du grignotage en récréation sans parler du verre de lait (long à digérer) servi parfois trop près de l'heure du repas"]
[]
[]
[]
[null,null,"Au repas si l'enfant mange beaucoup de pain avec ou en remplacement du plat proposé; les quantités ingérées seront d'autant diminuées. Pour limiter le \"gaspillage\" et satisfaire les \"gourmants\"; vous pouvez avoir recours à cet exemple de service."]
[]
[]
[]
[null,null,"POSSON PANÉ",null,null,null,"Poids unitaire du produit ",null,0.09,"Grammages à servir",null,0.12]
[]
[]
[null,null,{"$f":"IF(E689=\"\",\"produit à servir\",\"produits entiers à couper en \")","v":"produits entiers à couper en "},null,{"$f":"IF(K696=1,\"\",K696)","v":1.5},{"$f":"LARGE(F697:F701,1)","v":3},"parts","pour",{"$f":"LARGE(G697:G701,1)","v":2},"enfants"]
[]
[]
[null,null,{"$f":"IF(D692=\"\",\"MOINS\",\"Servir \")","v":"Servir "},{"$f":"IF(F689-1=0,\"\",F689-1)","v":2},{"$f":"IF(D692=\"\",\"\",IF(G692=1,\"produits entiers de\",\"produits coupés en \"))","v":"produits entiers de"},null,{"$f":"IF(D692=\"\",\"\",I689/D692)","v":1},{"$f":"IF(D692=\"\",\"\",\"parts\")","v":"parts"},{"$f":"IF(D692=\"\",\"\",\"grammage unitaire\")","v":"grammage unitaire"},null,{"$f":"IF(D692=\"\",\"\",I686/G692)","v":0.09}]
[]
[null,null,{"$f":"IF(D692=\"\",\"\",\"plus\")","v":"plus"},{"$f":"IF(D692=\"\",\"\",F689-D692)","v":1},{"$f":"IF(D694=\"\",\"\",\"produit coupé en \")","v":"produit coupé en "},null,{"$f":"IF(E694=\"\",\"\",I689)","v":2},{"$f":"IF(E694=\"\",\"\",\"parts\")","v":"parts"},null,{"$f":"IF(D694=\"\",\"moins\",\" de\")","v":" de"},{"$f":"IF(E694=\"\",I686-L686,I686/G694)","v":4.4999999999999998E-2}]
[]
[null,null,"Poids  produit à servir","Poids  produit envoyé","Écart de poids","Meilleur rapport",null,"produits entiers","pour",null,{"$f":"LARGE(L697:L701,1)","v":1.5},{"$f":"SMALL(E697:E701,COUNTIF(E697:E701,0)+1)","v":3.0000000000000027E-2}]
[null,null,{"$f":"L686*I697","v":0},{"$f":"I686*H697","v":0.09},{"$f":"D697-C697","v":0.09},{"$f":"IF(E697=L696,H697,0)","v":0},{"$f":"IF(F697>0,I697,0)","v":0},1,{"$f":"INT(J697)","v":0},{"$f":"D697/L686","v":0.75},{"$f":"IF(F697=0,0,F697/G697)","v":0},{"$f":"ROUNDDOWN(K697,1)","v":0}]
[null,null,{"$f":"L686*I698","v":0.12},{"$f":"I686*H698","v":0.18},{"$f":"D698-C698","v":0.06},{"$f":"IF(E698=L696,H698,0)","v":0},{"$f":"IF(F698>0,I698,0)","v":0},2,{"$f":"INT(J698)","v":1},{"$f":"D698/L686","v":1.5},{"$f":"IF(F698=0,0,F698/G698)","v":0},{"$f":"ROUNDDOWN(K698,1)","v":0}]
[null,null,{"$f":"L686*I699","v":0.24},{"$f":"I686*H699","v":0.27},{"$f":"D699-C699","v":3.0000000000000027E-2},{"$f":"IF(E699=L696,H699,0)","v":3},{"$f":"IF(F699>0,I699,0)","v":2},3,{"$f":"INT(J699)","v":2},{"$f":"D699/L686","v":2.2500000000000004},{"$f":"IF(F699=0,0,F699/G699)","v":1.5},{"$f":"ROUNDDOWN(K699,1)","v":1.5}]
[null,null,{"$f":"L686*I700","v":0.36},{"$f":"I686*H700","v":0.36},{"$f":"D700-C700","v":0},{"$f":"IF(E700=L696,H700,0)","v":0},{"$f":"IF(F700>0,I700,0)","v":0},4,{"$f":"INT(J700)","v":3},{"$f":"D700/L686","v":3},{"$f":"IF(F700=0,0,F700/G700)","v":0},{"$f":"ROUNDDOWN(K700,1)","v":0}]
[null,null,{"$f":"L686*I701","v":0.36},{"$f":"I686*H701","v":0.44999999999999996},{"$f":"D701-C701","v":8.9999999999999969E-2},{"$f":"IF(E701=L696,H701,0)","v":0},{"$f":"IF(F701>0,I701,0)","v":0},5,{"$f":"INT(J701)","v":3},{"$f":"D701/L686","v":3.7499999999999996},{"$f":"IF(F701=0,0,F701/G701)","v":0},{"$f":"ROUNDDOWN(K701,1)","v":0}]
[]
[]
[null,null,"Tableaux pour service ou cuisson"]
[null,null,"1 = saisissez le poids dans un contenant (une louche une barquette etc,,)"]
[null,null,null,null,"2 =  saisissez le poids de la portion à servir par convive"]
[null,null,"Police de couleur pour saisir vos valeurs    Noir = formules"]
[null,null," Poids dans 1 contenant",null,"Poids d' une Portion"]
[]
[null,null,10,null,0.1,null,null,null,null,null,"1 louche ou 1 contenant pour ",{"$f":"C710/E710","v":100}]
[null,null,1,null,7.0000000000000007E-2,null,null,null,null,null,"1 louche ou 1 contenant pour ",{"$f":"C711/E711","v":14.285714285714285}]
[]
[null,null,"1 = saisissez le poids dans un contenant (une louche une barquette etc,,)"]
[null,null,null,null,"2 =  saisissez le nombre de portions à servir"]
[null,null," Poids dans 1 contenant",null,"Nb de Portions à servir",null,"Exemples",null,null,null,null,null,"Poids de la portion"]
[]
[null,null,0.9,null,7,null,"1 melon de ",null,null,{"$f":"C717","v":0.9},"pour",{"$f":"E717","v":7},{"$f":"C717/E717","v":0.12857142857142859}]
[null,null,3.5,null,20,null,"1 plaque hachis parmentier ",null,null,{"$f":"C718","v":3.5},"pour",{"$f":"E718","v":20},{"$f":"C718/E718","v":0.17499999999999999}]
[]
[]
[]
[null,null,"Total Mx dans 1 contenant",null,"Portion Nb de Mx par portion",null,"Nb portions","Police de couleur pour saisir vos valeurs    Noir = formules"]
[]
[null,null,32,null,1.45,null,{"$f":"C724/E724","v":22.068965517241381},"QUOI ?"]
[]
[null,null,"EXEMPLES"]
[null,null,32,null,1.2,null,{"$f":"C727/E727","v":26.666666666666668},"32 tranches par plaque ( 1 plaque pour 26 maternelles)"]
[null,null,12,null,1,null,12,"table de 12"]
[null,null,32,null,2,null,16,"32 tranches par plaque ( 1 plaque pour 16 adultes)"]
[null,null,32,null,1.2,null,26.666666666666668,"32 tranches par plaque ( 1 plaque pour 16 adultes)"]
[null,null,33,null,1.3,null,25.384615384615383,"1 plaque pour 25 ( 1 tranche par maternelle plus RAB )"]
[null,null,33,null,1.5,null,22,"33 tranches par plaque ( 1.5 tranches par primaire)"]
[null,null,30,null,1.2,null,25,"1 plaque pour 25 ( 1 morceau par maternelle plus RAB )"]
[null,null,33,null,1.6,null,20.625,"1 plaque pour 20 ( 1 morceau par primaire plus RAB )"]
[null,null,33,null,2,null,16.5,"1 plaque pour 16 ( 1 morceau par adulte plus RAB )"]
[null,null,48,null,6,null,8,"1 plaque pour 8 ( 6 morceau par adulte + )"]
[null,null,1,null,0.25,null,4,"1 CITRON POUR 4"]
[null,null,25,null,1,null,25,"1 Boite de compote pour 25"]
[]
[null,null,"Le contenant peut être une louche pour le service un gastro pour la cuisson  etc…"]
[null,null,"Les Mx cela peut s'appliquer à des morceaux de bourguignon mais aussi des tomates farcies ou des oreillons de pêches au sirop pour le dessert etc.."]
[]
[]
[]
[]
[]
[null,"Combien faut-il commander pour des effectifs et des grammages différents"]
[]
[null,"Petit utilitaire d'Aide à la décision"]
[]
[null,null,null,null,"Saisissez vos effectifs ",250,620,37,14,{"$f":"SUM(F751:I751)","v":921},"couverts"]
[null,null,null,null," et vos grammages nets à servir",4.4999999999999998E-2,7.0000000000000007E-2,0.11,0.13,null,"% de perte",25,"@"]
[null,null,null,null,"Familles de convives","Mater","Prim","Adultes","Adultes +","Quantités à Prévoir"]
[null,null,null,null,"Net à servir :",{"$f":"F752*F751","v":11.25},{"$f":"G752*G751","v":43.400000000000006},{"$f":"H752*H751","v":4.07},{"$f":"I752*I751","v":1.82},{"$f":"SUM(F754:I754)","v":60.540000000000006},null,"Net"]
[null,null,null,null,"Brut à Commander",{"$f":"F754/(100-L752)*100","v":15},{"$f":"G754/(100-L752)*100","v":57.866666666666674},{"$f":"H754/(100-L752)*100","v":5.4266666666666667},{"$f":"I754/(100-L752)*100","v":2.4266666666666667},{"$f":"SUM(F755:I755)","v":80.72},null,"Brut"]
[null,null,null,null,null,null,null,null,null,{"$f":"J755-J754","v":20.179999999999993},null,"poids de perte"]
[null,null,null,null,null,null,null,null,null,{"$f":"(J756/J751)*1000","v":21.910966340933761},null,"en moyenne par convive"]
[null,null,"@","Facultatif Mais si vous saisissez un % la question à vous poser c'est : le produit brut ou cru perd comblien au parage ou en cuisson"]
[null,null,null,"Vous obtiendrez le poids brut à commander"]
[]
[]
[]
["ICI","QUANTITÉS A SERVIR OU A COMMANDER",null,null,null,null,null,null,null,null,null,null,null,1]
[]
[null,"DESCRIPTIF"]
[null," Saisissez vos effectifs Saisissez vos quantités pour vos familles de convives et vous obtiendrez le net à servir. Avez-vous un pourcentage de perte (à l'épluchage -au parage en cuisson ou autre)…saisissez le et vous obtiendrez les quantités brutes à commander"]
[]
[]
[]
[]
[null,null,null,null,null,null,null,null,null,null,null,"❶"]
[null,null,null,null,null,null,null,null,null,null,"Que traitez vous : des Kg des litres des pièces des portions …des poires etc…","pommes"]
[]
[null,null,null,null,null,"Famille de convives","Mater","Prim","Adultes","Adultes +","Seniors"]
[null,null,null,null,null,"Saisissez vos effectifs ",50,500,150,13,13,{"$f":"SUM(G775:K775)","v":726},"couverts"]
[null,null,null,null,null,"Saisissez vos quantités nets à servir",0.5,1,1,2,1,{"$f":"SUM(G776:K776)/COUNTIF(G776:K776,\">0\")","v":1.1000000000000001},"de moyenne"]
[null,null,null,null,null,"Net à préparer :",{"$f":"G776*G775","v":25},{"$f":"H776*H775","v":500},{"$f":"I776*I775","v":150},{"$f":"J776*J775","v":26},{"$f":"K776*K775","v":13},{"$f":"SUM(G777:K777)","v":714},{"$f":"L772","v":"pommes"}]
[null,null,null,null,null,null,{"$f":"L772","v":"pommes"},{"$f":"L772","v":"pommes"},{"$f":"L772","v":"pommes"},{"$f":"L772","v":"pommes"},{"$f":"L772","v":"pommes"}]
[null,null,"% de perte",10,"❷"]
[null,null,null,null,null,"Brut à Commander",{"$f":"G777/(100-D779)*100","v":27.777777777777779},{"$f":"H777/(100-D779)*100","v":555.55555555555554},{"$f":"I777/(100-D779)*100","v":166.66666666666669},{"$f":"J777/(100-D779)*100","v":28.888888888888886},{"$f":"K777/(100-D779)*100","v":14.444444444444443},{"$f":"SUM(G780:K780)","v":793.33333333333337},{"$f":"L772","v":"pommes"}]
[null,null,null,null,null,null,{"$f":"L772","v":"pommes"},{"$f":"L772","v":"pommes"},{"$f":"L772","v":"pommes"},{"$f":"L772","v":"pommes"},{"$f":"L772","v":"pommes"}]
[]
[null,"❶","Collez une des unités suivante ou saisissez un nom de produit"]
[null,null,"litres",null,null,"Kg",null,null,"Portions",null,null,"Pièce(s)"]
[null,"❷","si vous n'avez pas de perte ne saisissez rien"]
[null,"Familles de convives :Mater = enfants Maternelles Prim = enfants de l'enseignement Primaire Adulte = sédentaire Adulte + = travailleur de force Seniors = nos Ainés je classe les Adolescennts en Adultes +"]
[]
[null,"Adresse PC",{"$f":"CELL(\"nomfichier\")","v":"E:\\0-UPRT\\1-UPRT.FR-SITE-WEB\\re-recettes-jean-marc-catteau\\re-catteau-galettes\\[GA-pate.sud.finistere.xlsm]Modes.d'emploi"}]
[null,"Mise à jour","du 03-01-2017 Annule et remplace les versions précédentes"]
[null,"Adaptation : Joël Leboucher..UPRT \"Union des Personnels de la Restauration Territoriale\"  membre du réseau RESTAU'CO"]
[]
["ICI","COMBIEN POURRIEZ VOUS SERVIR AVEC",null,null,null,null,null,null,null,null,null,null,null,2]
[]
[null,"DESCRIPTIF"]
[null,"Vous avez préparé ou il vous reste un poids X d'une préparation. Avec ce poids combien de convives ou combien de portions pourrez vous servir"]
[]
[]
[]
[]
[null,null,null,null,null,null,null,null,null,null,null,"❶"]
[null,null,null,null,null,null,null,null,null,null,"Poids de votre préparation ",2.4]
[]
[]
[null,null,null,null,null,"Famille de convives","Mater","Prim","Adultes","Adultes +","Seniors"]
[null,null,null,null,null,"Saisissez vos grammages nets à servir",0.05,0.08,0.11,0.125,7.0000000000000007E-2,{"$f":"SUM(G805:K805)/COUNTIF(G805:K805,\">0\")","v":8.6999999999999994E-2},"de moyenne"]
[null,null,null,null,null,"Vous pourrIez servir",{"$f":"L801/G805","v":47.999999999999993},{"$f":"L801/H805","v":30},{"$f":"L801/I805","v":21.818181818181817},{"$f":"L801/J805","v":19.2},{"$f":"L801/K805","v":34.285714285714285},"Portions / pièces / parts"]
[null,"❶","A vous de saisir un poids"]
[null,"BONUS"]
[null,null,null,null,null,null,null,null,null,null,null,"❷"]
[null,null,null,null,null,null,null,null,null,null,"Que traitez vous : des Kg des litres des pièces des portions …des poires etc…","Kg"]
[]
[null,null,null,null,null,"Saisissez vos effectifs ",50,500,150,13,13,{"$f":"SUM(G812:K812)","v":726},"couverts"]
[null,null,null,null,null,"Vous devriez préparer :",{"$f":"G805*G812","v":2.5},{"$f":"H805*H812","v":40},{"$f":"I805*I812","v":16.5},{"$f":"J805*J812","v":1.625},{"$f":"K805*K812","v":0.91000000000000014},{"$f":"SUM(G813:K813)","v":61.534999999999997},{"$f":"L810","v":"Kg"}]
[null,null,null,null,null,null,{"$f":"L810","v":"Kg"},{"$f":"L810","v":"Kg"},{"$f":"L810","v":"Kg"},{"$f":"L810","v":"Kg"},{"$f":"L810","v":"Kg"}]
[null,null,"% de perte",50,"❸"]
[null,null,null,null,null,"Brut à Commander",{"$f":"G813/(100-D815)*100","v":5},{"$f":"H813/(100-D815)*100","v":80},{"$f":"I813/(100-D815)*100","v":33},{"$f":"J813/(100-D815)*100","v":3.25},{"$f":"K813/(100-D815)*100","v":1.8200000000000005},{"$f":"SUM(G816:K816)","v":123.07000000000001},{"$f":"L810","v":"Kg"}]
[null,null,null,null,null,null,{"$f":"L810","v":"Kg"},{"$f":"L810","v":"Kg"},{"$f":"L810","v":"Kg"},{"$f":"L810","v":"Kg"},{"$f":"L810","v":"Kg"}]
[null,"❸","si vous n'avez pas de perte ne saisissez rien"]
[null,"❷","Collez une des unités suivante ou saisissez un nom de produit"]
[null,null,"Kg",null,null,"Portions",null,null,"Pièce(s)",null,null,"litres"]
[]
[null,"Familles de convives :Mater = enfants Maternelles Prim = enfants de l'enseignement Primaire Adulte = sédentaire Adulte + = travailleur de force Seniors = nos Ainés je classe les Adolescennts en Adultes +"]
[]
[null,"Adresse PC",{"$f":"CELL(\"nomfichier\")","v":"E:\\0-UPRT\\1-UPRT.FR-SITE-WEB\\re-recettes-jean-marc-catteau\\re-catteau-galettes\\[GA-pate.sud.finistere.xlsm]Modes.d'emploi"}]
[null,"Mise à jour","du 03-01-2017 Annule et remplace les versions précédentes"]
[null,"Adaptation : Joël Leboucher..UPRT \"Union des Personnels de la Restauration Territoriale\"  membre du réseau RESTAU'CO"]
[]
[]
[]
["RÉFLEXION SUR DES MODÈLE DE RÉPERTOIRES"]
[]
[]
[null,null,null,null,"Créer un ou plusieurs répertoires n'est pas tâche facile…à chacun de classer comme il le souhaite"]
[null,null,null,null,null,"par famille de produits"]
[null,null,null,null,null,"par technique"]
[null,null,null,null,null,"par ingrédients "]
[null,null,null,null,null,"etc...autant de possibilités que de façons de penser"]
[null,null,null,null,"vous pouvez utiliser un disque dur externe qui vous suivra partout"]
[]
[]
[]
[]
[null,null,"Répertoire Patisserie",null,null,null,null,null,"Répertoire \"Postits\" Alpha par type de fabrication si possible"]
[]
[null,null,null,"Entremets"]
[null,null,null,"A",null,null,null,"C"]
[null,null,null,"B",null,null,null,null,"Cracker (Pâte à)"]
[null,null,null,"C",null,null,null,null,"Cracker (Poudre à)"]
[null,null,null,"D",null,null,null,"F"]
[null,null,null,"Etc…",null,null,null,null,"Fraises des bois dans leur jus"]
[null,null,null,null,null,null,null,"I"]
[null,null,null,"Tartes",null,null,null,null,"Insert Kappa fraise"]
[null,null,null,"A",null,null,null,"J"]
[null,null,null,"B",null,null,null,null,"Jus de fraise"]
[null,null,null,"C",null,null,null,"K"]
[null,null,null,"D",null,null,null,null,"Kappa fraise"]
[null,null,null,"Etc…",null,null,null,"S"]
[null,null,null,null,null,null,null,null,"Sorbet Avocat"]
[null,null,null,"Gros Gateaux",null,null,null,null,"Siphon Fraise"]
[null,null,null,"A",null,null,null,null,"Sauce Fraise"]
[null,null,null,"B",null,null,null,null,"Sirop à Crackers"]
[null,null,null,"C"]
[null,null,null,"Coussin Cœur St Valentin 2014 François Perret Journal du Patissier N° 292 page 40"]
[null,null,null,"D"]
[null,null,null,"Etc…"]
[]
[null,null,null,"Pièces individuelles"]
[null,null,null,"A"]
[null,null,null,"B"]
[null,null,null,"C"]
[null,null,null,"D"]
[null,null,null,"Etc…"]
[]
[]
[null,null,"Transmettez vos savoirs faires peut importe qui les récupèrent pourvu qu'ils servent à un plus grand nombre"]
[]
[null,null,"Bonne utilisation et… à chacun d'améliorer et d'adapter ces documents.  J Leboucher"]

{"sheet":"Poids fruits et légumes","index":10,"n_rows":128,"n_cols":51,"rows_kept":128,"cut":false,"hidden":false,"merged":[[73,31,74,31],[73,32,73,34],[73,35,73,38],[101,27,101,29],[102,27,103,28],[0,1,0,21],[1,1,3,6],[1,8,3,13],[1,15,3,20],[4,0,67,0],[4,7,67,7],[4,14,67,14],[4,21,67,21]]}
[null,"POIDS DES FRUITS ET LÉGUMES  …décembre 2017 annule et remplace les versions précédentes"]
[null,"Saisissez votre nombre d'unité (encre rouge)Modifiez le poids unitaire (encre verte) s'il n'est pas excact",null,null,null,null,null,null,"Saisissez votre nombre d'unité (encre rouge)Modifiez le poids unitaire (encre verte) s'il n'est pas excact",null,null,null,null,null,null,"Saisissez votre nombre d'unité (encre rouge)Modifiez le poids unitaire (encre verte) s'il n'est pas excact"]
[]
[]
[null,"N°","Produits","Poids unitaire","Nb d'unités","Poids en Gr","Poids en Kg",null,"N°","Produits","Poids unitaire","Nb d'unités","Poids en Gr","Poids en Kg",null,"N°","Produits","Poids unitaire","Nb d'unités","Poids en Gr","Poids en Kg"]
[null,null,"A",null,null,null,null,null,null,"G",null,null,null,null,null,null,"R",null,null,null,null,null,null,"4.1. Poids et mesures (A-C)",null,null,null,null,null,null,null,"Poids moyen (à la pièce, en grammes).  ",null,null,null,null,null,null,null,null,null,null,null,null,null,null,null,"LIENS"]
[null,1,"Abricot",55,10,{"$f":"(D7*E7)","v":550},{"$f":"F7/1000","v":0.55000000000000004},null,{"$f":"B66+1","v":56},"Hareng",170,10,{"$f":"(K7*L7)","v":1700},{"$f":"M7/1000","v":1.7},null,{"$f":"I68+1","v":113},"Raisin sec Tasse thé de 15 cl",20,10,{"$f":"(R7*S7)","v":200},{"$f":"T7/1000","v":0.2}]
[null,{"$f":"LARGE(B7:B7,1)+1","v":2},"Ail gousse",5,10,50,0.05,null,{"$f":"LARGE(I7:I7,1)+1","v":57},"Haricot sec Verre de 20 cl",160,10,{"$f":"(K8*L8)","v":1600},1.6,null,{"$f":"LARGE(P7:P7,1)+1","v":114},"Riz long Verre de 20 cl",125,10,1250,1.25,null,null,"Aliment","Mesure de capacité ","Poids",null,"Aliment","Mesure de capacité ","Poids",null,"Biscuit sec : 10. Biscotte : 18. Croissant : 50. ",null,null,null,null,null,null,null,null,null,null,null,null,null,null,null,"http://www.nubel.be/fra/manual/liste_des_denrees_alimentaires.asp"]
[null,{"$f":"LARGE(B7:B8,1)+1","v":3},"Ail gousse moyenne",8,10,80,0.08,null,{"$f":"LARGE(I7:I8,1)+1","v":58},"Homard moyen",885,10,8850,8.85,null,null,"S",0,null,0,0]
[null,{"$f":"LARGE(B7:B9,1)+1","v":4},"Ail tête",50,10,500,0.5,null,{"$f":"LARGE(I7:I9,1)+1","v":59},"Homard petit",500,10,5000,5,null,{"$f":"LARGE(P7:P9,1)+1","v":115},"Sardine",45,10,450,0.45,null,null,"Ananas (frais)/ananas (boîte)","1 tranche moyenne","100 g/35 g",null,"Mandarine","1 moyenne","60 g",null," Crustacés (entiers) : écrevisse 34, homard 885. ",null,null,null,null,null,null,null,null,null,null,null,null,null,null,null,"https://www.nubel.be/fra/default.aspx"]
[null,{"$f":"LARGE(B7:B10,1)+1","v":5},"Ananas",2000,10,20000,20,null,null,"L",0,null,0,0,null,{"$f":"LARGE(P7:P10,1)+1","v":116},"Sel 1 pincée",1,10,10,0.01,null,null,"Avocat","1 moyen","160 g",null,"Mangue","1 moyenne","200 g"]
[null,{"$f":"LARGE(B7:B11,1)+1","v":6},"Artichaut",350,10,3500,3.5,null,{"$f":"LARGE(I7:I11,1)+1","v":60},"Lapin vidé",1500,10,15000,15,null,{"$f":"LARGE(P7:P11,1)+1","v":117},"Sel fin 1 cuillère café rase",50,10,500,0.5,null,null,"Abricot (sans noyau)",1,"150 g",null,"Maquereau fumé","1 filet","145 g",null," Fromages : camembert 250, livarot 500, pont-l'évêque 320, petit-suisse 25-30, yaourt (petit pot) 120-150. ",null,null,null,null,null,null,null,null,null,null,null,null,null,null,null,"POIDS MOYEN BRUT DE LA PIÈCE",null,"http://www.basesdelacuisine.com/Cadre1/z1/pp80.htm"]
[null,{"$f":"LARGE(B7:B12,1)+1","v":7},"Avocat 1/2",110,10,1100,1.1000000000000001,null,{"$f":"LARGE(I7:I12,1)+1","v":61},"Lentilles Verre de 20 cl",150,10,1500,1.5,null,{"$f":"LARGE(P7:P12,1)+1","v":118},"Sel fin 1 cuillère soupe rase",15,10,150,0.15,null,null,null,null,null,null,"Margarine","1 cuillère","18 g"]
[null,{"$f":"LARGE(B7:B13,1)+1","v":8},"Avocat entier",220,10,2200,2.2000000000000002,null,null,"M",0,null,0,0,null,{"$f":"LARGE(P7:P13,1)+1","v":119},"Sel fin 1 tasse",200,10,2000,2,null,null,"Bacon","1 fine tranche","11 g",null,"Mayonnaise","1 cuillère","25 g",null,"Fruits : abricot 55, banane 150, citron 125, datte 10, figue sèche 42, figue fraîche 45, mandarine 100, noix 13, orange 180, pamplemousse 400, pêche 130, poire 180, pomme 120, pruneau 15. ",null,null,null,null,null,null,null,null,null,null,null,null,null,null,null,"Fruits et légumes frais Poids moyen d'une pièce",null,null,"http://lahalledepessac.com/content/14-fruits-et-legumes-frais-poids-moyen-d-une-piece"]
[null,null,"B",0,null,0,0,null,{"$f":"LARGE(I7:I14,1)+1","v":62},"Maizena 1 cuillère soupe",10,10,100,0.1,null,{"$f":"LARGE(P7:P14,1)+1","v":120},"Sel pour 1 Kg Blé",12,10,120,0.12,null,null,"Banane","1 moyenne","130 g",null,"Melon","1 moyen","540 g"]
[null,{"$f":"LARGE(B7:B15,1)+1","v":9},"Banane",120,10,1200,1.2,null,{"$f":"LARGE(I7:I15,1)+1","v":63},"Melon gros",800,10,8000,8,null,{"$f":"LARGE(P7:P15,1)+1","v":121},"Sel pour 1 Kg Foie gras",12,10,120,0.12,null,null,"Beurre","1 cuillère","18 g",null,"Merlan","1 filet","100 g",null," Légumes : artichaut 250, aubergine 225, chou 1 000, chou-fleur 1 200, laitue 500, romaine 400, chicorée frisée 400, melon 700-1 000, radis (la botte) 350, tomate 100, oignon 125. ",null,null,null,null,null,null,null,null,null,null,null,null,null,null,null,"TABLES DE GRAMMAGES","http://etab.ac-poitiers.fr/lycee-hotelier-la-rochelle/IMG/pdf/Grammage_4.pdf"]
[null,{"$f":"LARGE(B7:B16,1)+1","v":10},"Baton de vanille",8,10,80,0.08,null,{"$f":"LARGE(I7:I16,1)+1","v":64},"Melon portion",500,10,5000,5,null,{"$f":"LARGE(P7:P16,1)+1","v":122},"Sel pour 1 Kg Merguez",19,10,190,0.19,null,null,"Beurre de cacahuète","1 cuillère","15 g",null,"Miel","1 cuillère","27 g"]
[null,{"$f":"LARGE(B7:B17,1)+1","v":11},"Beurre 1 cuillère café",4,10,40,0.04,null,{"$f":"LARGE(I7:I17,1)+1","v":65},"Merlan",230,10,2300,2.2999999999999998,null,{"$f":"LARGE(P7:P17,1)+1","v":123},"Sel pour 1 Kg Pâtes alimentaires",12,10,120,0.12,null,null,"Bière (pils)","1 verre à bière","250 ml",null,"Milk-shake","1 verre","150 ml",null," Poissons (entiers) : brochet 1 250, carpe 775, colin 2 000, daurade 600, églefin 350, hareng 170, saur 130, limande 150, maquereau 250, merlan 230, plie 160, sardine 45, truite 450, turbot 2 350. ",null,null,null,null,null,null,null,null,null,null,null,null,null,null,null,"POIDS MOYEN BRUT LEGUMES ET FRUITS ",null,"http://dmcwilshim.canalblog.com/archives/2009/01/18/12131475.html"]
[null,{"$f":"LARGE(B7:B18,1)+1","v":12},"Beurre 1 cuillère soupe",15,10,150,0.15,null,{"$f":"LARGE(I7:I18,1)+1","v":66},"Mouton 1/2 carcasse",9.5,10,95,9.5000000000000001E-2,null,{"$f":"LARGE(P7:P18,1)+1","v":124},"Sel pour 1 Kg Pommes terre",13,10,130,0.13,null,null,"Biscotte blanche/complète",1,"8 g/10 g",null,"Moule","1 pièce","4 g"]
[null,{"$f":"LARGE(B7:B19,1)+1","v":13},"Beurre 1 noisette",4,10,40,0.04,null,{"$f":"LARGE(I7:I19,1)+1","v":67},"Mouton carré couvert (5+3)",900,10,9000,9,null,{"$f":"LARGE(P7:P19,1)+1","v":125},"Sel pour 1 Kg Saucisse a griller",12,10,{"$f":"(R20*S20)/1000","v":0.12},1.1999999999999999E-4,null,null,"Biscuit",1,"10 g",null,"Muesli","1 tasse à café","50 g",null,"Sucre (morceau) : 6.",null,null,null,null,null,null,null,null,null,null,null,null,null,null,null,"Correspondance Calibre/ Poids fruits legumes"]
[null,{"$f":"LARGE(B7:B20,1)+1","v":14},"Beurre 1 noix",15,10,150,0.15,null,{"$f":"LARGE(I7:I20,1)+1","v":68},"Mouton carré découvert (5)",900,10,9000,9,null,{"$f":"LARGE(P7:P20,1)+1","v":126},"Sel pour 1 Kg Semoule a couscous",13,10,{"$f":"(R21*S21)/1000","v":0.13},1.3000000000000002E-4,null,null,"Biscuit apéritif","1 pièce","4 g"]
[null,{"$f":"LARGE(B7:B21,1)+1","v":15},"Beurre 1 tasse",200,10,2000,2,null,{"$f":"LARGE(I7:I21,1)+1","v":69},"Mouton cervelle ",230,10,2300,2.2999999999999998,null,{"$f":"LARGE(P7:P21,1)+1","v":127},"Semoule Tasse thé de 15 cl",110,10,{"$f":"(R22*S22)/1000","v":1.1000000000000001},1.1000000000000001E-3,null,null,"Biscuit au chocolat",1,"20 g",null,"Nectarine",1,"95 g",null,"Viandes : lapin (vidé) 1 500 ; oie (entière) 5 500 ; poulet (entier) 1 800. Cervelle : bœuf 500, veau 300, mouton 100, porc 110.",null,null,null,null,null,null,null,null,null,null,null,null,null,null,null,"https://portal.health.fgov.be/pls/portal/docs/PAGE/INTERNET_PG/HOMEPAGE_MENU/ABOUTUS1_MENU/INSTITUTIONSAPPARENTEES1_MENU/HOGEGEZONDHEIDSRAAD1_MENU/ADVIEZENENAANBEVELINGEN1_MENU/ADVIEZENENAANBEVELINGEN1_DOCS/6545-2_POIDSETMESURES_FR_2005_2.PDF"]
[null,{"$f":"LARGE(B7:B22,1)+1","v":16},"Bœuf Cervelle",500,10,5000,5,null,{"$f":"LARGE(I7:I22,1)+1","v":70},"Mouton cœur",230,10,2300,2.2999999999999998,null,{"$f":"LARGE(P7:P22,1)+1","v":128},"Semoule Verre de 20 cl",130,10,{"$f":"(R23*S23)/1000","v":1.3},1.2999999999999999E-3,null,null,"Boudin blanc",1,"100 g",null,"Noisettes","10 pièces","12 g",null,"Cœur : bœuf 2 750, veau 500, mouton 230, porc 225. Foie : bœuf 8 500, veau 2 500, porc 750. "]
[null,{"$f":"LARGE(B7:B23,1)+1","v":17},"Bœuf cœur",2750,10,27500,27.5,null,{"$f":"LARGE(I7:I23,1)+1","v":71},"Mouton épaule",1.7,10,17,1.7000000000000001E-2,null,{"$f":"LARGE(P7:P23,1)+1","v":129},"Sole T1",280,10,{"$f":"(R24*S24)","v":2800},2.8,null,null,"Boudin noir",1,"100 g",null,null,null,null,null," Langue : bœuf 4 000, veau 1 000. Pied de porc 200. Ris de veau 750. Rognon : bœuf 1 000, veau 250, porc 170.",null,null,null,null,null,null,null,null,null,null,null,null,null,null,null,"http://www.aliments.org/poids.htm"]
[null,{"$f":"LARGE(B7:B24,1)+1","v":18},"Bœuf entrecôte",6000,10,60000,60,null,{"$f":"LARGE(I7:I24,1)+1","v":72},"Mouton gigot raccourci",2.2000000000000002,10,22,2.1999999999999999E-2,null,{"$f":"LARGE(P7:P24,1)+1","v":130},"Sole T2",350,10,3500,3.5,null,null,"Boudoir",1,"5,5 g",null,"Oeuf cuit",1,"50 g"]
[null,{"$f":"LARGE(B7:B25,1)+1","v":19},"Bœuf faux filet",8000,10,80000,80,null,{"$f":"LARGE(I7:I25,1)+1","v":73},"Mouton selle anglaise",2,10,20,0.02,null,{"$f":"LARGE(P7:P25,1)+1","v":131},"Sole T3",500,10,5000,5,null,null,null,null,null,null,"Oignon","1 moyen","115 g",null,null,null,null,null,null,null,null,null,null,null,null,null,null,null,null,null,"http://www.astro.ulg.ac.be/cours/magain/stat/stat52.html"]
[null,{"$f":"LARGE(B7:B26,1)+1","v":20},"Bœuf filet",4200,10,42000,42,null,null,"N",0,null,0,0,null,{"$f":"LARGE(P7:P26,1)+1","v":132},"Sole T4 + de",600,10,6000,6,null,null,"Cabillaud","1 darne","175 g",null,"Olive","1 moyenne","4 g",null,"Modification.   Poids brut d'aliments résultant de la cuisson de:"]
[null,{"$f":"LARGE(B7:B27,1)+1","v":21},"Bœuf foie",8500,10,85000,85,null,{"$f":"LARGE(I7:I27,1)+1","v":74},"Noix",8,10,80,0.08,null,{"$f":"LARGE(P7:P27,1)+1","v":133},"Sole T4 + de",800,10,8000,8,null,null,"Cacahuètes","1 cuillère/10 pièces","20 g/20 g",null,"Omelette (1 œuf)",1,"60 g",null,null,null,null,null,null,null,null,null,null,null,null,null,null,null,null,null,"lien : une portion c'est combien   sur la nutrition.fr"]
[null,{"$f":"LARGE(B7:B28,1)+1","v":22},"Bœuf langue",4000,10,40000,40,null,{"$f":"LARGE(I7:I28,1)+1","v":75},"Noix épluchées Tasse thé de 15 cl",50,10,500,0.5,null,{"$f":"LARGE(P7:P28,1)+1","v":134},"Sucre morceaux",5,10,50,0.05,null,null,"Café/thé","1 tasse","125g",null,"Orange","1 moyenne","140 g",null,"100 g d'aliments crus. Farineux : coquillettes 385, macaronis 400, nouilles 385, riz 295, spaghettis 385. "]
[null,{"$f":"LARGE(B7:B29,1)+1","v":23},"Bœuf rognon",1000,10,10000,10,null,null,"O",0,null,0,0,null,{"$f":"LARGE(P7:P29,1)+1","v":135},"Sucre semoule 1 cuillère café",5,10,50,0.05,null,null,"Cake","1 fine tranche","30 g"]
[null,{"$f":"LARGE(B7:B30,1)+1","v":24},"Bœuf train côtes milieu",8500,10,85000,85,null,{"$f":"LARGE(I7:I30,1)+1","v":76},"Oeuf  le blanc",30,10,300,0.3,null,{"$f":"LARGE(P7:P30,1)+1","v":136},"Sucre semoule 1 cuillère soupe",15,10,150,0.15,null,null,"Cake fourré aux fruits","1 fine tranche","35 g",null,"Pain blanc/gris","1 tranche carrée","27 g",null,"100 g d'aliments crus. Légumes frais : artichauts 87, asperges 87, bettes 90, betteraves rouges à l'eau 91, au four 57, carottes à l'eau 100, à l'étouffée 64, "]
[null,{"$f":"LARGE(B7:B31,1)+1","v":25},"Brochet",1250,10,12500,12.5,null,{"$f":"LARGE(I7:I31,1)+1","v":77},"Oeuf gros",60,10,600,0.6,null,{"$f":"LARGE(P7:P31,1)+1","v":137},"Sucre semoule 1 tasse",200,10,2000,2,null,null,"Canard/faisan","1 portion","125 g",null,"Pain blanc/gris","1 tranche ronde","29 g"]
[null,null,"C",null,null,0,0,null,{"$f":"LARGE(I7:I32,1)+1","v":78},"Oeuf moyen",50,10,500,0.5,null,{"$f":"LARGE(P7:P32,1)+1","v":138},"Sucre Verre de 20 cl",150,10,1500,1.5,null,null,"Carambole","1 pièce","155 g",null,"Pain complet","1 tranche carrée","35 g",null,"100 g d'aliments crus. légumes frais : , céleris (côtes) 94, raves cuites à l'eau 91, sautées 54, champignons de couche frits 83, "]
[null,{"$f":"LARGE(B7:B33,1)+1","v":26},"Cacao poudre 1 cuillère soupe",8,10,80,0.08,null,{"$f":"LARGE(I7:I33,1)+1","v":79},"Oeuf petit",40,10,400,0.4,null,null,"T",0,null,0,0,null,null,"Carotte","1 moyenne","100 g",null,"Pain complet","1 tranche ronde","45 g"]
[null,{"$f":"LARGE(B7:B34,1)+1","v":27},"Cacao Tasse thé de 15 cl",120,10,1200,1.2,null,{"$f":"LARGE(I7:I34,1)+1","v":80},"Œufs 1 douzaine",50,12,600,0.6,null,{"$f":"LARGE(P7:P34,1)+1","v":139},"Tapioca Tasse thé de 15 cl",100,10,1000,1,null,null,"Céleri rave, cru","1 portion","85 g",null,"Pain grillé blanc/gris",1,"21 g",null,"100 g d'aliments crus. légumes frais :  chou vert, cuit à l'eau 92, à l'étouffée 64, de Bruxelles 86, -fleur 92, "]
[null,{"$f":"LARGE(B7:B35,1)+1","v":28},"Canard vidé",1500,10,15000,15,null,{"$f":"LARGE(I7:I35,1)+1","v":81},"Œufs blanc d'",30,10,300,0.3,null,{"$f":"LARGE(P7:P35,1)+1","v":140},"Thon boite 1/10",80,10,800,0.8,null,null,"Céréales de petit déjeuner","1 tasse à café","40 g",null,"Pain d'épices","1 tranche","23 g"]
[null,{"$f":"LARGE(B7:B36,1)+1","v":29},"Carotte moyenne",120,10,1200,1.2,null,{"$f":"LARGE(I7:I36,1)+1","v":82},"Œufs entiers",50,10,500,0.5,null,{"$f":"LARGE(P7:P36,1)+1","v":141},"Thon boite 1/3 saladière",260,10,2600,2.6,null,null,"Cerise (sans noyau)",1,"4 g",null,"Pain de seigle","1 tranche","40 g",null,"100 g d'aliments crus. légumes frais : épinards cuits à l'eau ou au jus 83, haricots verts cuits à l'eau 104, à l'étouffée 90, navets, cuits à l'eau 95, à l'étouffée 92,"]
[null,{"$f":"LARGE(B7:B37,1)+1","v":30},"Céléri 1 branche",35,10,350,0.35,null,{"$f":"LARGE(I7:I37,1)+1","v":83},"Œufs jaune",20,10,200,0.2,null,{"$f":"LARGE(P7:P37,1)+1","v":142},"Thon boite 1/5",160,10,1600,1.6,null,null,"Cervelas",1,"150 g",null,"Pain de viande","1 fine tranche","30 g"]
[null,{"$f":"LARGE(B7:B38,1)+1","v":31},"Céléri rave",1000,10,10000,10,null,{"$f":"LARGE(I7:I38,1)+1","v":84},"Oignon moyen",70,10,700,0.7,null,{"$f":"LARGE(P7:P38,1)+1","v":143},"Thon boite 1/6 basse",430,10,4300,4.3,null,null,"Champignon, cuit","1 cuillère","30 g",null,"Pain français (baguette)","1 moyen","260 g",null,"100 g d'aliments crus. légumes frais : poireaux 81, p. de terre en robe des champs 98, à l'anglaise 95, au four 80, en purée 119, en ragoût 154, frites 44 1, "]
[null,{"$f":"LARGE(B7:B39,1)+1","v":32},"Cerises",65,10,650,0.65,null,{"$f":"LARGE(I7:I39,1)+1","v":85},"Olives",4,10,40,0.04,null,{"$f":"LARGE(P7:P39,1)+1","v":144},"Thon boite 1/8",52,10,520,0.52,null,null,"Chicon",1,"100 g",null,"Pamplemousse","1 moyen","200 g"]
[null,{"$f":"LARGE(B7:B40,1)+1","v":33},"Choux fleur",1500,10,15000,15,null,{"$f":"LARGE(I7:I40,1)+1","v":86},"Orange",240,10,2400,2.4,null,{"$f":"LARGE(P7:P40,1)+1","v":145},"Thon boite 4/4 saladière",118,10,1180,1.18,null,null,"Chips","1 paquet","30 g",null,"Papaye","1 moyenne","125 g",null,"100 g d'aliments crus. légumes frais : , potiron 55, scarole 71, tomates frites 69. Légumes secs : fèves 310, haricots 270,"]
[null,{"$f":"LARGE(B7:B41,1)+1","v":34},"Choux vert",2000,10,20000,20,null,{"$f":"LARGE(I7:I41,1)+1","v":87},"Orange moyenne",140,10,1400,1.4,null,{"$f":"LARGE(P7:P41,1)+1","v":146},"Tomate grosse",110,10,1100,1.1000000000000001,null,null,"Chocolat","1 barre","25 g",null,"Parmesan","1 cuillère","10 g"]
[null,{"$f":"LARGE(B7:B42,1)+1","v":35},"Citron moyen",80,10,800,0.8,null,null,"P",0,null,0,0,null,{"$f":"LARGE(P7:P42,1)+1","v":147},"Tomate moyenne",50,10,500,0.5,null,null,"Chou de Bruxelles, cuit","1 cuillère","40 g",null,"Pastèque","1 moyenne","1125 g",null,"100 g d'aliments crus. légumes frais : ,, pois cassés 400. "]
[null,{"$f":"LARGE(B7:B43,1)+1","v":36},"Clémentine",70,10,700,0.7,null,{"$f":"LARGE(I7:I43,1)+1","v":88},"Pamplemousse",400,10,4000,4,null,{"$f":"LARGE(P7:P43,1)+1","v":148},"Tomate petite",50,10,500,0.5,null,null,"Chou-fleur/brocoli, cuit","1 cuillère","30 g",null,"Pâte à tartiner (choco)","1 cuillère","33 g"]
[null,{"$f":"LARGE(B7:B44,1)+1","v":37},"Colin",2000,10,20000,20,null,{"$f":"LARGE(I7:I44,1)+1","v":89},"Pêche",120,10,1200,1.2,null,{"$f":"LARGE(P7:P44,1)+1","v":149},"Truite portion",250,10,2500,2.5,null,null,"Citron","1 moyen","70 g",null,"Pâté de foie","1 cuillère","15 g",null,"100 g d'aliments crus. l Poissons : au court-bouillon 95, frits 81. Crevettes : 97. "]
[null,{"$f":"LARGE(B7:B45,1)+1","v":38},"Concombre",200,10,2000,2,null,{"$f":"LARGE(I7:I45,1)+1","v":90},"Pied veau",1,10,10,0.01,null,{"$f":"LARGE(P7:P45,1)+1","v":150},"Turbot",3500,10,35000,35,null,null,"Clémentine",1,"35 g",null,"Pâtes, cuites","1 tasse à café","210 g"]
[null,{"$f":"LARGE(B7:B46,1)+1","v":39},"Coquillette Verre de 20 cl",120,10,1200,1.2,null,{"$f":"LARGE(I7:I46,1)+1","v":91},"Poireau beau",200,10,2000,2,null,null,"V",0,null,0,0,null,null,"Compote de pommes","1 cuillère","40 g",null,"Pâtes, sèches","1 tasse à café","70 g",null,"100 g d'aliments crus.  Viandes : bœuf : bifteck grillé 88, au gril 83, au plat 88, rôti (1/2 h) 77, bouilli 83. "]
[null,{"$f":"LARGE(B7:B47,1)+1","v":40},"Courgette",350,10,3500,3.5,null,{"$f":"LARGE(I7:I47,1)+1","v":92},"Poireau blanc de",40,10,400,0.4,null,{"$f":"LARGE(P7:P47,1)+1","v":151},"Veau carré couvert (5+3)",2200,10,22000,22,null,null,"Concombre, cru","1 portion","85 g",null,"Pêche (sans noyau)",1,"125 g"]
[null,{"$f":"LARGE(B7:B48,1)+1","v":41},"Cresson botte",200,10,2000,2,null,{"$f":"LARGE(I7:I48,1)+1","v":93},"Poireau moyen",150,10,1500,1.5,null,{"$f":"LARGE(P7:P48,1)+1","v":152},"Veau carré découvert (5)",2000,10,20000,20,null,null,"Confiture","1 cuillère","30 g",null,"Pickles","1 cuillère","15 g",null,"100 g d'aliments crus.  Viandes :  Veau : à la poêle 93, rôti (3/4 d'h) 74. Mouton : rôti 73, sauté 69. "]
[null,{"$f":"LARGE(B7:B49,1)+1","v":42},"Cuillère café liquide",5,10,50,0.05,null,{"$f":"LARGE(I7:I49,1)+1","v":94},"Poivron",150,10,1500,1.5,null,{"$f":"LARGE(P7:P49,1)+1","v":153},"Veau cervelle",300,10,3000,3,null,null,"Corned-beef","1 fine tranche","20 g",null,"Pistolet",1,"45 g"]
[null,{"$f":"LARGE(B7:B50,1)+1","v":43},"Cuillère soupe liquide",10,10,100,0.1,null,{"$f":"LARGE(I7:I50,1)+1","v":95},"Pomelos 1/2",200,10,2000,2,null,{"$f":"LARGE(P7:P50,1)+1","v":154},"Veau cœur",900,10,9000,9,null,null,"Corn Flakes","1 tasse à café","30 g",null,"Plie","1 pièce","135 g",null,"100 g d'aliments crus.  Viandes :  Porc : côtelette 83, rôti 64. Cheval : bifteck à la poêle 93. Foie : 91. Boudin : 94. Saucisse fraîche : 92."]
[null,null,"D",0,null,0,0,null,{"$f":"LARGE(I7:I51,1)+1","v":96},"Pomme",140,10,1400,1.4,null,{"$f":"LARGE(P7:P51,1)+1","v":155},"Veau Foie",3500,10,35000,35,null,null,"Couque à la crème",1,"80 g",null,"Poire","1 moyenne","160 g"]
[null,{"$f":"LARGE(B7:B52,1)+1","v":44},"Daurade",600,10,6000,6,null,{"$f":"LARGE(I7:I52,1)+1","v":97},"Pomme de terre moyenne",100,10,1000,1,null,{"$f":"LARGE(P7:P52,1)+1","v":156},"Veau langue",1200,10,12000,12,null,null,"Couque au beurre",1,"75 g",null,"Poireau, cuit","1 cuillère","45 g",null,null,"Verres"]
[null,null,"E",0,null,0,0,null,{"$f":"LARGE(I7:I53,1)+1","v":98},"Pomme fruit grosse",150,10,1500,1.5,null,{"$f":"LARGE(P7:P53,1)+1","v":157},"Veau noix",3100,10,31000,31,null,null,"Couque suisse","1 longue / ronde","75 g / 90 g",null,"Poivron vert/jaune/rouge","1 pièce","185 g",null,null,"Petit verre à eau/limonade, rempli normalement 150"]
[null,{"$f":"LARGE(B7:B54,1)+1","v":45},"Eau grand verre à eau",200,10,2000,2,null,{"$f":"LARGE(I7:I54,1)+1","v":99},"Pomme fruit moyenne",100,10,1000,1,null,{"$f":"LARGE(P7:P54,1)+1","v":158},"Veau noix patissière",2650,10,26500,26.5,null,null,"Courgette, cuite","1 cuillère","35 g",null,"Pomme","1 moyenne","140 g"]
[null,{"$f":"LARGE(B7:B55,1)+1","v":46},"Echalote belle",25,10,250,0.25,null,{"$f":"LARGE(I7:I55,1)+1","v":100},"Pomme terre grosse",200,10,2000,2,null,{"$f":"LARGE(P7:P55,1)+1","v":159},"Veau ris",750,10,7500,7.5,null,null,"Cramique","1 tranche","40 g",null,"Pomme de terre, cuite (ovale)",1,"50 g",null,null,"Grand verre à eau/limonade, rempli normalement 250"]
[null,{"$f":"LARGE(B7:B56,1)+1","v":47},"Echalote moyenne",18,10,180,0.18,null,{"$f":"LARGE(I7:I56,1)+1","v":101},"Pomme terre moyenne",120,10,1200,1.2,null,{"$f":"LARGE(P7:P56,1)+1","v":160},"Veau rognon",350,10,3500,3.5,null,null,"Crème","1 cuillère","24 g",null,"Pomme de terre, rôtie","1 cuillère","30 g"]
[null,{"$f":"LARGE(B7:B57,1)+1","v":48},"Echalote petite",10,10,100,0.1,null,{"$f":"LARGE(I7:I57,1)+1","v":102},"Pomme terre petite",80,10,800,0.8,null,{"$f":"LARGE(P7:P57,1)+1","v":161},"Veau sous noix",6200,10,62000,62,null,null,"Crème à fouetter","1 cuillère","12 g",null,"Porto","1 petit verre","75 ml",null,null,"Verre à vin: blanc/rouge, rempli normalement 125"]
[null,{"$f":"LARGE(B7:B58,1)+1","v":49},"Ecrevisse",35,10,350,0.35,null,{"$f":"LARGE(I7:I58,1)+1","v":103},"Porc cervelle ",225,10,2250,2.25,null,null,null,null,null,null,null,null,null,"Crème glacée","1 boule","50 g",null,"Poulet, poitrine (sans peau)","1 filet","160 g"]
[null,null,"F",0,null,0,0,null,{"$f":"LARGE(I7:I59,1)+1","v":104},"Porc cœur",225,10,2250,2.25,null,null,null,null,null,null,null,null,null,"Crêpe","1 pièce","60 g",null,"Poulet, cuisse(sans peau)","1 cuisse","165 g",null,null,"Verre à mousseux, rempli normalement 100"]
[null,{"$f":"LARGE(B7:B60,1)+1","v":50},"Farine 1 cuillère café",3,10,30,0.03,null,{"$f":"LARGE(I7:I60,1)+1","v":105},"Porc foie",750,10,7500,7.5,null,null,null,null,null,null,null,null,null,"Crevettes","1 cuillère","18 g",null,"Praline",1,"15 g"]
[null,{"$f":"LARGE(B7:B61,1)+1","v":51},"Farine 1 cuillère soupe",8,10,80,0.08,null,{"$f":"LARGE(I7:I61,1)+1","v":106},"Porc jambon",8.6,10,86,8.5999999999999993E-2,null,null,null,null,null,null,null,null,null,"Croissant","1 moyen","50 g",null,"Prune, sans noyau","1 moyenne","55 g",null,null,"Verre à bière, rempli normalement 250 et 330"]
[null,{"$f":"LARGE(B7:B62,1)+1","v":52},"Farine 1 tasse",100,10,1000,1,null,{"$f":"LARGE(I7:I62,1)+1","v":107},"Porc longe",11.5,10,115,0.115,null,null,null,null,null,null,null,null,null,"Croque-monsieur",1,"135 g",null,"Prune, sèche",1,"6 g"]
[null,{"$f":"LARGE(B7:B63,1)+1","v":53},"Farine Tasse thé de 15 cl",100,10,1000,1,null,{"$f":"LARGE(I7:I63,1)+1","v":108},"Porc poitrine",3.75,10,37.5,3.7499999999999999E-2,null,null,null,null,null,null,null,null,null,"Croquette de pomme de terre (c)","1 moyenne","27 g",null,"Pudding","1 portion","125 g/200 g",null,null,"Lors de l’établissement du poids des denrées alimentaires liquides (boissons alcoolisées,"]
[null,{"$f":"LARGE(B7:B64,1)+1","v":54},"Farine Verre de 20 cl",135,10,1350,1.35,null,{"$f":"LARGE(I7:I64,1)+1","v":109},"Porc rognon",170,10,1700,1.7,null,null,null,null,null,null,null,null,null,null,null,null,null,"Purée de pommes de terre","1 cuillère/portion","50 g/160 g"]
[null,{"$f":"LARGE(B7:B65,1)+1","v":55},"Fraise",12,10,120,0.12,null,{"$f":"LARGE(I7:I65,1)+1","v":110},"Poulet 4/4",1000,10,10000,10,null,null,null,null,null,null,null,null,null,null,null,null,null,null,null,null,null,null,"lait, lait chocolaté et lait de soja, milkshake et yaourt) les \"ml\" ont été assimilés aux \"g\""]
[null,null,null,null,null,null,null,null,{"$f":"LARGE(I7:I66,1)+1","v":111},"Poulet pac",1500,10,15000,15,null,null,null,null,null,null,null,null,null,"Aliment","Mesure de capacité ","Poids",null,"Aliment","Mesure de capacité ","Poids",null,null,"(source 7.104)."]
[null,null,null,null,null,null,null,null,{"$f":"LARGE(I7:I67,1)+1","v":112},"Pruneau",15,10,150,0.15]
[null,null,null,null,null,null,null,null,null,null,null,null,null,null,null,null,null,null,null,null,null,null,null,"Datte sèche (sans noyau)",1,"9 g",null,"Radis","1 pièce","6 g",null,null,"Pour la crème glacée et la mousse, le facteur de conversion est mentionné dans la colonne"]
[null,null,null,null,null,null,null,null,null,null,null,null,null,null,null,null,null,null,null,null,null,null,null,null,null,null,null,"Raisin",1,"7 g",null,null,"précisions."]
[null,null,null,null,null,null,null,null,null,null,null,null,null,null,null,null,null,null,null,null,null,null,null,"Éclair au chocolat","1 pièce","115 g",null,"Raisin, sec","1 cuillère","12 g"]
[null,null,null,null,null,null,null,null,null,null,null,null,null,null,null,null,null,null,null,null,null,null,null,"Edam jeune","1 fine tranche","25 g",null,"Ravioli","1 portion","400 g"]
[null,null,null,null,null,null,null,null,null,null,null,null,null,null,null,null,null,null,null,null,null,null,null,null,null,null,null,"Riz au lait, vanille","1 portion","100 g/200 g",null,"Nota : (1) En cuisant, les pommes frites absorbent 8 à 10 % de matières grasses."]
[null,null,null,null,null,null,null,null,null,null,null,null,null,null,null,null,null,null,null,null,null,null,null,"Farine","1 cuillère","12 g",null,"Riz, cuit","1 portion","150 g",null,"Besoins journaliers (limites moyennes)","En grammes",null,null,"En milligrammes"]
[null,null,null,null,null,null,null,null,null,null,null,null,null,null,null,null,null,null,null,null,null,null,null,"Fécule de pomme de terre","1 cuillère","12 g",null,"Riz, non cuit","1 sachet","62,5 g",null,null,"Protides","Lipides","Glucides","Calcium 7","Phosphore","Fer","Vit. C"]
[null,null,null,null,null,null,null,null,null,null,null,null,null,null,null,null,null,null,null,null,null,null,null,"Fenouil",1,"200 g",null,null,null,null,null,"Jeunes"]
[null,null,null,null,null,null,null,null,null,null,null,null,null,null,null,null,null,null,null,null,null,null,null,"Fève de soja, cuite","1 tasse à café","140 g",null,"Salami","1 fine tranche","9 g",null," 2 à 4 ans","30/35",32,"200/250","700/750","650/700","40/94","40/60"]
[null,null,null,null,null,null,null,null,null,null,null,null,null,null,null,null,null,null,null,null,null,null,null,"Figue, sèche","1 pièce","20 g",null,"Sandwich sucré",1,"40 g",null," 4 à 6 ans","35/40",33,"200/250","600/800","600/800","40/94","40/60"]
[null,null,null,null,null,null,null,null,null,null,null,null,null,null,null,null,null,null,null,null,null,null,null,"Filet d'Anvers","1 tranche","15 g",null,"Sardine","1 pièce","33 g",null," 6 à 10 ans","45/55",37,"300/340","850/950","850/950","40/94","40/60"]
[null,null,null,null,null,null,null,null,null,null,null,null,null,null,null,null,null,null,null,null,null,null,null,"Flétan, fumé","1 fine tranche","30 g",null,"Saumon","1 tranche","180 g",null,"10 à 12 ans (filles 9 à 11)","60/65",50,"350/400 1","1 000/1 200","1 100/1 300","20/30","60/100"]
[null,null,null,null,null,null,null,null,null,null,null,null,null,null,null,null,null,null,null,null,null,null,null,"Flocons d'avoine","1 tasse à café","45 g",null,"Saumon, fumé","1 fine tranche","30 g",null,"12 à 15 ans (filles 11 à 13)","5/9 2",65,"440/550 3","1 200/1 400","1 300/1 500","20/30","60/100"]
[null,null,null,null,null,null,null,null,null,null,null,null,null,null,null,null,null,null,null,null,null,null,null,"Fraise","1 moyenne","15 g",null,"Sel","1 cuillère","15 g",null,"15 à 20 ans (filles 13 à 18)","75/100 4",75,"550/600 5","1 400/1 600","1 500/1 700","20/30","60/100"]
[null,null,null,null,null,null,null,null,null,null,null,null,null,null,null,null,null,null,null,null,null,null,null,"Frangipane","1 part","100 g",null,"Soupe","1 tasse/1 assiette","300 ml/250 ml",null,"Hommes"]
[null,null,null,null,null,null,null,null,null,null,null,null,null,null,null,null,null,null,null,null,null,null,null,"Frites","1 portion","250 g",null,"Spaghetti, préparé","1 assiette","300 g",null,"Vie sédentaire","75/85 4",60,"400/500","800/900","1 200/1 400","18/20","70/80"]
[null,null,null,null,null,null,null,null,null,null,null,null,null,null,null,null,null,null,null,null,null,null,null,"Fromage frais","1 cuillère","25 g",null,"Spéculoos","1 pièce","7 g",null,"Travail de force"]
[null,null,null,null,null,null,null,null,null,null,null,null,null,null,null,null,null,null,null,null,null,null,null,"Fromage fondu","1 portion/cuillère","20 g/15 g",null,"Sucre","1 cuillère/morceau","15 g/6 g",null," 4e et 3e cat.","85/110",75,"550/700","1 000/1 200","1 500/1 800","23/26","90/110"]
[null,null,null,null,null,null,null,null,null,null,null,null,null,null,null,null,null,null,null,null,null,null,null,"Fruit de la passion","1 moyen","15 g",null,"Sucre impalpable","1 cuillère","6 g",null," 2e et 1re cat.","100/110",95,"850/1 000","1 400/1 600","2 000/2 400","30/45","130/150"]
[null,null,null,null,null,null,null,null,null,null,null,null,null,null,null,null,null,null,null,null,null,null,null,null,null,null,null,null,null,null,null,"Femmes"]
[null,null,null,null,null,null,null,null,null,null,null,null,null,null,null,null,null,null,null,null,null,null,null,"Galette de riz","1 pièce","7 g",null,"Tarte à la confiture","1 part","80 g",null,"Vie sédentaire","65/75 4",50,"350/400","800/900","1 000/1 200","15/20","60/70"]
[null,null,null,null,null,null,null,null,null,null,null,null,null,null,null,null,null,null,null,null,null,null,null,"Gaufre au chocolat","1 moyenne","60 g",null,"Tarte au riz","1 part","140 g",null,"Enceintes (5e-9e mois) 6","90/110",80,"500/550","1 500/2 000","1 500/2 000","20/25","100/150"]
[null,null,null,null,null,null,null,null,null,null,null,null,null,null,null,null,null,null,null,null,null,null,null,"Gaufre de Liège","1 moyenne","55 g",null,"Tarte aux fruits","1 part","165 g",null,"Allaitant 6 ","100/110",80,"500/550","1 500/2 000","1 500/2 000","20/25","100/150"]
[null,null,null,null,null,null,null,null,null,null,null,null,null,null,null,null,null,null,null,null,null,null,null,"Gouda","1 fine tranche","20 g",null,"Tarte aux mattons","1 morceau","120 g",null,"Vieillards 6 ",65,45,"300/400","900/1 000","900/1 000","14/16","50/60"]
[null,null,null,null,null,null,null,null,null,null,null,null,null,null,null,null,null,null,null,null,null,null,null,"Graisse de cuisson","1 cuillère","18 g",null,"Toast","1 pièce","3 g"]
[null,null,null,null,null,null,null,null,null,null,null,null,null,null,null,null,null,null,null,null,null,null,null,"Gruyère","1 fine tranche","25 g",null,"Tomate","1 moyenne","150 g",null,"Nota : Pour les filles : (1) 330/350, (2) 80/85, (3) 400/500, (4) 85-90, (5) 500/550. (6) Vie sédentaire ou légère activité. (7) Contenu surtout dans le fromage et le lait."]
[null,null,null,null,null,null,null,null,null,null,null,null,null,null,null,null,null,null,null,null,null,null,null,"Gruyère, râpé","1 cuillère","15 g",null,"Truite","1 pièce","120 g"]
[]
[null,null,null,null,null,null,null,null,null,null,null,null,null,null,null,null,null,null,null,null,null,null,null,"Hamburger + sandwich","1 moyenne","130 g",null,"Viande de porc, côtelette","1 avec/sans côte","175g /160 g"]
[null,null,null,null,null,null,null,null,null,null,null,null,null,null,null,null,null,null,null,null,null,null,null,"Haricot blanc, cuit /sec","1 cuillère","35 g/105 g",null,"Viande de porc, tranche",1,"150 g"]
[null,null,null,null,null,null,null,null,null,null,null,null,null,null,null,null,null,null,null,null,null,null,null,"Hareng/maatje","1 moyen","80 g",null,"Vin de table blanc/rouge","1 verre","125 ml"]
[null,null,null,null,null,null,null,null,null,null,null,null,null,null,null,null,null,null,null,null,null,null,null,"Huile","1 cuillère","10 g",null,"Yaourt","1 cuillère","25 g"]
[]
[null,null,null,null,null,null,null,null,null,null,null,null,null,null,null,null,null,null,null,null,null,null,null,"Jambon, cru, fumé","1 fine tranche","25 g",null,"4. MESURES DE CAPACITE*"]
[null,null,null,null,null,null,null,null,null,null,null,null,null,null,null,null,null,null,null,null,null,null,null,"Jambon, cuit","1 fine tranche","45 g",null,"Mesures de capacité calculées à partir d’eau             ",null,"Poids en grammes"]
[null,null,null,null,null,null,null,null,null,null,null,null,null,null,null,null,null,null,null,null,null,null,null,"Jambon de dinde","1 fine tranche","20 g"]
[null,null,null,null,null,null,null,null,null,null,null,null,null,null,null,null,null,null,null,null,null,null,null,"Jambon de poulet","1 fine tranche","20 g",null,"Cuillère à café",null,"4,5 g"]
[null,null,null,null,null,null,null,null,null,null,null,null,null,null,null,null,null,null,null,null,null,null,null,"Jus de pomme/jus d'orange","1 verre","150 ml",null,"Cuillère à soupe",null,"12 g"]
[null,null,null,null,null,null,null,null,null,null,null,null,null,null,null,null,null,null,null,null,null,null,null,"Ketchup","1 cuillère","23 g",null,"Cuillère à dessert",null,"8 g"]
[null,null,null,null,null,null,null,null,null,null,null,null,null,null,null,null,null,null,null,null,null,null,null,"Kiwi","1 moyen","75 g",null,"Cuillère à sauce",null,"25 g"]
[null,null,null,null,null,null,null,null,null,null,null,null,null,null,null,null,null,null,null,null,null,null,null,null,null,null,null,"Louche",null,"150 g"]
[null,null,null,null,null,null,null,null,null,null,null,null,null,null,null,null,null,null,null,null,null,null,null,"Lait","1 verre","150 ml",null,"Tasse à ras bord",null,"150 g"]
[null,null,null,null,null,null,null,null,null,null,null,null,null,null,null,null,null,null,null,null,null,null,null,"Lait battu nature","1 verre","150 ml",null,"Tasse liquide",null,"125 g"]
[null,null,null,null,null,null,null,null,null,null,null,null,null,null,null,null,null,null,null,null,null,null,null,"Lait chocolaté","1 petite bouteille","200 ml",null,"Grande tasse à ras bord",null,"250 g"]
[null,null,null,null,null,null,null,null,null,null,null,null,null,null,null,null,null,null,null,null,null,null,null,"Lait concentré","1 portion individuelle","7,5 g",null,"Grande tasse liquide",null,"225 g"]
[null,null,null,null,null,null,null,null,null,null,null,null,null,null,null,null,null,null,null,null,null,null,null,"Langue de bœuf","1 fine tranche","15 g",null,"Gobelet plastique à ras bord",null,"150 g"]
[null,null,null,null,null,null,null,null,null,null,null,null,null,null,null,null,null,null,null,null,null,null,null,"Lapin/lièvre (cuisse)","1 morceau","250 g",null,"Gobelet plastique liquide",null,"125 g"]
[null,null,null,null,null,null,null,null,null,null,null,null,null,null,null,null,null,null,null,null,null,null,null,"Lard fumé","1 petite tranche","15 g",null,"Bol de soupe à ras bord",null,"300 g"]
[null,null,null,null,null,null,null,null,null,null,null,null,null,null,null,null,null,null,null,null,null,null,null,"Lasagne","1 portion","400 g",null,"Bol de soupe liquide",null,"250 g"]
[null,null,null,null,null,null,null,null,null,null,null,null,null,null,null,null,null,null,null,null,null,null,null,"Levure fraîche","1 petit paquet","42 g",null,"Ravier à dessert",null,"150 g"]
[null,null,null,null,null,null,null,null,null,null,null,null,null,null,null,null,null,null,null,null,null,null,null,"Limonade/cola/eau","1 verre","150 ml",null,"Verre à limonade/eau",null,"150 g"]
[null,null,null,null,null,null,null,null,null,null,null,null,null,null,null,null,null,null,null,null,null,null,null,"Litchi",1,"11 g",null,"Verre à limonade grand",null,"250 g"]
[null,null,null,null,null,null,null,null,null,null,null,null,null,null,null,null,null,null,null,null,null,null,null,null,null,null,null,"Verre à vin rouge",null,"125 g"]
[null,null,null,null,null,null,null,null,null,null,null,null,null,null,null,null,null,null,null,null,null,null,null,null,null,null,null,"Verre à vin blanc",null,"125 g"]
[null,null,null,null,null,null,null,null,null,null,null,null,null,null,null,null,null,null,null,null,null,null,null,null,null,null,null,"Verre à champagne",null,"100 g"]
[null,null,null,null,null,null,null,null,null,null,null,null,null,null,null,null,null,null,null,null,null,null,null,null,null,null,null,"Verre à bière petit",null,"250 g"]
[null,null,null,null,null,null,null,null,null,null,null,null,null,null,null,null,null,null,null,null,null,null,null,null,null,null,null,"Verre à bière grand",null,"330 g"]
[]
[null,null,null,null,null,null,null,null,null,null,null,null,null,null,null,null,null,null,null,null,null,null,null,null,null,null,null,"* Source:"]
[null,null,null,null,null,null,null,null,null,null,null,null,null,null,null,null,null,null,null,null,null,null,null,null,null,null,null,"Groupe de travail « Poids et mesures », Conseil Supérieur d’Hygiène."]

{"sheet":"Tutos Youtube","index":11,"n_rows":285,"n_cols":16,"rows_kept":285,"cut":false,"hidden":false,"merged":[[232,1,232,2],[222,1,222,2],[218,1,218,2],[188,1,188,2],[1,1,3,15],[4,1,6,15]]}
[]
[null,"TUTOS YOUTUBE"]
[]
[]
[null,"Il arrive que vous ayez 2 tutos pour la même fonction, c'est volontaire parce que le plus important c'est de cliquer sur le nom de l'auteur sous la vidéo pour découvrir sa liste"]
[]
[]
[null,null,null,null,null,null,null,null,null,null,null,null,null,null,{"$f":"\"Page \"&_xlfn.SHEET()&\" sur \"&_xlfn.SHEETS()","v":"Page 12 sur 16"}]
[null,null,"Je remercie chaleureusement les internautes passionnés qui élaborent et proposent des formules et fonctions imbriquées"]
[null,null,"Ciquez sur les liens dans la colonne C"]
[null,null,"👇"]
[null," Excel principaux formats, actuels, ou obsolètes que nous allons pouvoir être amené à utiliser."]
[null,"Lien >","https://www.excelformation.fr/formats-fichiers-excel.html"]
[]
[null,"Fichier XLS ou XLSX ?"]
[null,"Lien >","https://www.excel-exercice.com/fichier-xls-ou-xlsx/"]
[]
[null,"Lien >","https://commentouvrir.com/extension/xlsm"]
[]
[null,null,"Les fichiers XLSM sont enregistrés au format Open XML introduit dans Microsoft Office 2007. "]
[null,null,"Les fichiers XLSM sont des fichiers . XLSX , mais avec les macros activées. "]
[null,null,"Une macro est une fonctionnalité utile qui fonctionne comme un script, ce qui permet aux utilisateurs d'automatiser des tâches répétitives."]
[]
[null,null,"Comment créer un fichier XLSM ?"]
[null,null,"Pour enregistrer sous forme de classeur prenant en charge les macros :"]
[null,null,"1. cliquer sur Non."]
[null,null,"2. Dans la boîte de dialogue Enregistrer sous, dans la zone de liste Enregistrer en tant que type, "]
[null,null,"sélectionnez Classeur Excel prenant en charge les macros (*. xlsm)."]
[null,null,"3. Cliquez sur Enregistrer."]
[]
[null,null,"Comment convertir un fichier XLSM en xlsx ?"]
[null,null,"Vous pouvez même utiliser Google Sheets pour convertir un fichier XLSM dans un format différent."]
[null,null," Avec le fichier ouvert là-bas, allez à Déposez le > Télécharger pour le télécharger sous forme de fichier XLSX, ODS, PDF, HTML, CSV ou TSV."]
[]
[null,"Modifier une macro"]
[null,"Lien >","https://support.microsoft.com/fr-fr/office/modifier-une-macro-ed9e8c3d-58fd-47a1-83eb-bdee680376bb"]
[]
[null,"Enregistrer une macro"]
[null,"Lien >","https://support.microsoft.com/fr-fr/office/enregistrer-une-macro-24a026ef-3145-4bf8-a5f2-2fc7889ff74a"]
[]
[null,"MACRO: SÉLECTIONNER TOUTE LA LIGNE ET LA COLONNE ACTIVE DANS UN TABLEAU EN VBA - DOCTEUR EXCEL"]
[null,"Lien >","https://www.youtube.com/watch?v=um737ZwwwoU"]
[]
[null,"Afficher les outils pour les macros - Excel"]
[null,"Lien >","https://www.pcastuces.com/pratique/astuces/5664.htm"]
[]
[null,null,"Vous avez besoin de travailler avec des macros dans Excel ?"]
[null,null," Affichez l'onglet Développeur dans le ruban afin d'accéder rapidement aux outils pour gérer vos macros et votre code Visual Basic."]
[null,null,"1. Cliquez avec le bouton droit de la souris sur le ruban et cliquez sur Personnaliser le ruban."]
[]
[null,null,"Comment afficher code macro Excel ?"]
[null,null,"Cliquez avec le bouton droit de la souris sur le ruban et cliquez sur Personnaliser le ruban. "]
[null,null,"Cochez la case Développeur dans la liste Onglets principaux. Validez par OK. "]
[null,null,"L'onglet Développeur est ajouté au ruban et vous permet d'accéder rapidement aux outils pour gérer vos macros et votre code Visual Basic."]
[]
[null,null,"Comment compléter une macro Excel ?"]
[null,null,"Sous l'onglet Développeur, dans le groupe Code, cliquez sur Macros. "]
[null,null,"Dans la zone Nom de la macro, cliquez sur la macro à modifier. Cliquez sur Modifier."]
[]
[]
[]
[null,"Lien >","Https://cellulexcel.blogspot.com/p/excel-trucs-astuces.html"]
[]
[null,null,"COMMENT TAPER UNE FRACTION sans qu'Excel l'interpètre comme une date    ----------------"]
[null,null,"Taper un zéro, un espace et la fraction =>  0 1/2"]
[]
[null,null,"COMMENT TAPER UNE ANNOTATION DANS UNE FORMULE    ----------------"]
[null,null,"Exemple en cellule C3"]
[null,null,"* Taper la formule =A1+A2  "]
[null,null,"* Pour mémoriser une annotation ajouter +N(\"Votre annotation\"). La fonction N transforme en zéro tout le texte placé en annotation et celle-ci reste visible"]
[null,null,"* Formule finalisée =>  =A1+A2+N(\"Somme de la cellule A1 et A2\") "]
[null,null," "]
[null,null," REPÉRER LES DOUBLONS DANS UNE COLONNE    ----------------"]
[null,null,"Exemple pour la colonne A "]
[null,null,"* Sélectionnez la colonne A dans son intégralité."]
[null,null,"* Dans l'onglet Accueil sélectionnez Mise en forme conditionnelle"]
[null,null,"* Cliquez sur Nouvelle Règle"]
[null,null,"* Cliquez sur Utiliser une formule pour déterminer pour quelles cellules le format sera appliqué."]
[null,null,"* Insérez la formule suivante =NB.SI(A:A;A1)>1"]
[null,null,"* Ensuite cliquez sur le bouton Format pour définir la mise en forme (Ex. Couleur de fond cliquez sur Remplissage)"]
[]
[null,null," AJOUTER DE POINTS FIN DE MOT OU DE PHRASE POUR PLUS DE LISIBILITE    ----------------"]
[null,null," Exemple : Total général ..................................   150,00 €"]
[]
[]
[null,"Analyser vos formules avec F9"]
[null,"Lien >","https://www.excel-exercice.com/analyser-vos-formules-avec-f9/"]
[]
[null,"Lien >","Trouver les liens externes d’un classeur"]
[]
[null,"Les formules logiques ET(), OU() et OUX() d’Excel pour combiner des tests"]
[null,"Lien >","https://www.youtube.com/watch?v=EbpC3cs2aTA"]
[]
[null,"Comment utiliser la formule MOD() pour calculer le reste d'une division euclidienne sur Excel"]
[null,"Lien >","https://www.youtube.com/watch?v=UnkKrv53fiA"]
[]
[null,"Comment arrondir un nombre sur Excel (mise en forme ou formule : la bonne méthode)"]
[null,"Lien >","https://www.youtube.com/watch?v=ycuXhxLIeY8"]
[]
[null,"Les formules logiques ET(), OU() et OUX() d’Excel pour combiner des tests"]
[null,"Lien >","https://www.youtube.com/watch?v=EbpC3cs2aTA"]
[]
[null,"Lien >","Excel SI-ALORS: comment fonctionne la formule SI ?"]
[]
[null,"Lien >","Faire des SI imbriqués dans Excel avec si.condition"]
[]
[null,"Lien >","Fonction INDIRECT - Exemples d'application"]
[]
[null,"COMMENT CONVERTIR DES UNITÉS DE MESURE SUR EXCEL ? AVEC LA FONCTION CONVERT()"]
[null,"Lien >","https://www.youtube.com/watch?v=t9BfPsVC5hk"]
[]
[]
[]
[null,"Comment devenir plus productif grâce aux raccourcis clavier Excel"]
[null,"Lien >","https://www.youtube.com/watch?v=xyjZP4GMmSc"]
[]
[null,"Tracer facilement les bordures"]
[null,"Lien >","https://www.excel-exercice.com/bordures/"]
[]
[null,"Formation Excel 2016 Faire un tableau"]
[null,"Lien >","FENÊTRE EXCEL"]
[]
[null,"Lien >","Déplacer ou copier des feuilles de calcul ou des données de feuille de calcul"]
[]
[null,"Lien >","copier une feuille de calcul du classeur actuel "]
[]
[null,"Comment synthétiser les informations sur Excel : le mode plan"]
[null,"Lien >","https://www.youtube.com/watch?v=zFR8-vdbebo"]
[]
[null,"LES 3 MÉTHODES POUR TRANSFORMER DES LIGNES EN COLONNES SUR EXCEL : AVANTAGES ET INCONVÉNIENTS"]
[null,"Lien >","https://www.youtube.com/watch?v=OZoAZHIP-kk&t=630s"]
[]
[null,"COMMENT COMPTER LE NOMBRE DE FEUILLES, DE LIGNES OU DE COLONNES EXCEL ?"]
[null,"Lien >","https://www.youtube.com/watch?v=ljG0dl6aZOk"]
[]
[null,"COMMENT CLASSER SIMPLEMENT DES DONNÉES AVEC LA FONCTION RANG (AVEC OU SANS EX ÆQUO) EXCEL ?"]
[null,"Lien >","https://www.youtube.com/watch?v=XB7PbjxQgiQ"]
[]
[null,"Comment créer un moteur de recherche… avec deux formules et sans VBA sur Excel"]
[null,"Lien >","https://www.youtube.com/watch?v=S_rTf5wWhr8"]
[]
[null,"Créer la table des matières d’un classeur"]
[null,"Lien >","https://www.excel-exercice.com/creer-la-table-des-matieres-dun-classeur/"]
[]
[null,"Comment afficher plusieurs feuilles d'un même classeur en même temps sur Excel"]
[null,"Lien >","https://www.youtube.com/watch?v=ign5pz_-R_I"]
[]
[null,"6 ASTUCES POUR IMPRIMER DES TABLEAUX EXCEL QUI DECHIRENT"]
[null,"Lien >","https://www.youtube.com/watch?v=eML_TISUYpw&t=31s"]
[]
[null,"COMMENT TRADUIRE UN TEXTE DANS TOUTES LES LANGUES EN UTILISANT UNE FONCTION EXCEL"]
[null,"Lien >","https://www.youtube.com/watch?v=wXenlFqrWWY"]
[]
[null,"Categorie : Manipulation"]
[null,"Lien >","https://www.excel-exercice.com/manipulation/"]
[]
[null,"Categorie : Les Add-Ins"]
[null,"Lien >","https://www.excel-exercice.com/add-in/"]
[]
[null,"Categorie : Nouveautés"]
[null,"Lien >","https://www.excel-exercice.com/nouveaute/"]
[]
[]
[]
[null,"Comment créer un mini comparateur de prix (récupérer les prix automatiquement ) sur Excel"]
[null,"Lien >","https://www.youtube.com/watch?v=jjhrpq-f-74&t=102s"]
[]
[null,"COMMENT CRÉER UNE LISTE DE COURSE AUTOMATIQUE AVEC UN TABLEAU CROISÉ DYNAMIQUE SUR EXCEL"]
[null,"Lien >","https://www.youtube.com/watch?v=_uhXSrAkHXc"]
[null,"Mes recettes de cuisine sur Excel"]
[null,"Lien >","https://www.youtube.com/watch?v=KK9rJpuHmZA"]
[]
[null,"gérer, consulter, modifier vos propres recettes de cuisine par l’intermédiaire d'Excel"]
[null,"Lien >","https://cellulexcel.blogspot.com/p/blog-page_22.html"]
[]
[null,"CRÉER SON CARNET DE RECETTES PERSONNALISÉ : PAPIER OU DIGITAL ?"]
[null,"Lien >","https://mccascabel.fr/carnet-de-recettes-personnalise/"]
[]
[null,"Excel - Comment générer des QR Codes dans Excel ?"]
[null,"Lien >","https://www.youtube.com/watch?v=_JzUgEGWuk0"]
[]
[null,"la SOMME d'une plage de cellules en fonction de leur couleur de fond."]
[null,"Lien >","https://cellulexcel.blogspot.com/p/somme.html"]
[]
[]
[]
[null,"Mettre en couleur toute une ligne dés qu'une cellule de cette ligne est remplie (excel)"]
[null,"Lien >","https://www.youtube.com/watch?v=21oGa9Q92s4"]
[null,"Excelpourlesbulles >",null,"https://www.youtube.com/channel/UCoTqCeSunCB3-puwIicURbw"]
[]
[null,"Colorier une ligne entière avec formule"]
[null,"Lien >","https://www.excel-exercice.com/colorier-une-ligne-entiere/"]
[]
[null,"Somme Si Couleur"]
[null,"Lien >","https://www.youtube.com/watch?v=7amIEwzFoF0"]
[]
[null,"Comment Compter Et Additionner Les Cellules En Fonction De La Couleur D'arrière-Plan Dans Excel?"]
[null,"Lien >","https://fr.extendoffice.com/documents/excel/1155-excel-count-sum-cells-by-color.html"]
[]
[null,"Tutoriel Excel : compter et additionner les cellules par couleur ?"]
[null,"Lien >","https://www.cours-gratuit.com/tutoriel-excel/tutoriel-excel-comment-compter-et-additionner-les-cellules-par-couleur"]
[]
[null,"----------------    COLORIER UNE COLONNE SUR DEUX    ----------------"]
[null,"Procédez de la même manière que précédemment mais en sélectionnant les colonnes ou une plage de cellules."]
[null,"Insérez la formule suivante => =EST.PAIR(COLONNE())"]
[null,"Vous pouvez même coloriser vos ligne et vos colonnes en appliquant les deux formules précédentes sur un ensemble de plage de cellules."]
[]
[null,"Mise en forme conditionnelle simple"]
[null,"Lien >","https://www.youtube.com/watch?v=xFOMtm4wRtE"]
[]
[null,"Colorier une ligne entière avec formule"]
[null,"Lien >","https://www.excel-exercice.com/colorier-une-ligne-entiere/"]
[]
[null,"Excel | Mise En Forme Conditionnelle sur toute une ligne"]
[null,"Lien >","https://www.youtube.com/watch?v=PbUvODhmdxI"]
[]
[null,"Excel - Mise en forme conditionnelle selon le contenu d'une autre cellule"]
[null,"Lien >","https://www.youtube.com/watch?v=Cxs3l7_EI4I"]
[null,"Lecompagnon >",null,"https://www.youtube.com/c/lecompagnoninfo/videos"]
[]
[null,"Colorer des lignes de façon conditionnelle dans un tableau Excel"]
[null,"Lien >","https://www.youtube.com/watch?v=ZEL3mVdUCcg"]
[null,"Bureautique Efficace >",null,"https://www.youtube.com/channel/UCmkKGwRm5LYN6zpgTVvNpdA/videos"]
[]
[null,"COMMENT SURLIGNER LA LIGNE DE LA CELLULE SÉLECTIONNÉE SUR EXCEL - TECHNIQUE AVANCÉE"]
[null,"Lien >","https://www.youtube.com/watch?v=OQJzipM0rgU"]
[]
[null,"Colorisation & autorisation saisie sur cellule"]
[null,"Lien >","https://forum.excel-pratique.com/excel/colorisation-autorisation-saisie-sur-cellule-121141#p739320"]
[]
[null,"Comment surligner la ligne de la cellule sélectionnée"]
[null,"Lien >","https://www.youtube.com/watch?v=Xvb1pAnQrts"]
[null,"Excel Formation >",null,"https://www.youtube.com/c/ExcelFormation/videos"]
[]
[null,"Dans un premier temps sélectionnez les lignes, ou une plage de cellules que vous souhaitez coloriser une ligne sur deux puis cliquez sur :",null,null,null,null,null,null,null,null,null,null,"https://www.excel-exercice.com/nouveaute/"]
[null,"1) Mise en forme conditionnelle"]
[null,"2) Gérer les règles "]
[null,"3) sur Nouvelle Règle"]
[null,"4) puis choisissez Utiliser une formule pour déterminer pour quelles cellules le format sera appliqué"]
[null,"5) Inséser la formule suivante dans l'environnement \"Appliquer une mise en forme aux valeurs pour lesquellles cette formule est vraie :\"",null,null,null,null,null,null,null,null,null,null,"https://www.youtube.com/channel/UCmkKGwRm5LYN6zpgTVvNpdA/videos"]
[]
[]
[null,null,"Quelques sites Excel pour vous aider à créer vos documents"]
[]
[null,"Fonctions complémentaires XLP"]
[null,"liens >","https://www.excel-pratique.com/fr/fonctions-complementaires.php"]
[]
[null,"Excel questions / Réponses"]
[null,"liens >","http://excel.engalere.com/tags/"]
[]
[null,"liens >","https://www.excel-exercice.com/ ",null,null,null,null,null,null,null,"Frédéric LE GUEN -  "]
[]
[null,"Lien >","https://www.youtube.com/user/ExcelExercice/videos"]
[]
[null,"Lien >","https://www.youtube.com/watch?v=e2kzRDcW5iI",null,null,null,null,null,null,null,"Formation informatique avec Cedric - "]
[]
[null,"Lien >","https://www.youtube.com/c/K%C3%A9vinBrundu/videos",null,null,null,null,null,null,null,"Kévin Brundu - "]
[]
[null,"Lien >","https://support.microsoft.com/fr-fr/excel",null,null,null,null,null,null,null,"Aide & apprentissage d'Excel - "]
[]
[null,"Lien >","https://www.youtube.com/c/TutoDeRien/playlists",null,null,null,null,null,null,null,"Tuto De Rien - "]
[]
[null,"Lien >","https://www.excel-exercice.com/somme-si-ens/",null,null,null,null,null,null,null,"Fonction SOMME.SI.ENS"]
[]
[null,"Lien >","https://www.youtube.com/channel/UCK4qfUuh9kpBByJFIMBPTtA/playlists",null,null,null,null,null,null,null,"prof couillon - "]
[]
[null,"liens >","https://www.youtube.com/watch?v=YfGrccEQGKk"]
[]
[null,"Lien >","https://www.youtube.com/watch?v=li4XNespLxg"]
[]
[null,"Lien >","Forum Bureautique"]
[]
[null,"Lien >","Alternatives à Microsoft Excel : 5 programmes gratuits et convaincants"]
[]
[null,"Lien >","Les 20 meilleurs Tricks Mathématiques"]
[]
[null,"Lien >","https://support.office.com/fr-fr/article/combiner-le-texte-de-deux-cellules-ou-plus-en-une-cellule-81ba0946-ce78-42ed-b3c3-21340eb164a6",null,null,null,null,null,null,null,null,null,null,"."]
[]
[null,"Lien >","https://www.youtube.com/watch?v=yk_ypXvUaHo",null,null,null,null,null,null,null,null,null,"Excel - fonctions date/heure"]
[]
[null,"lien >","http://www.mdf-xlpages.com/modules/publisher/item.php?itemid=91"]
[]
[null,"Transmettez votre savoir et votre savoir faire  peu importe qui le récupère; pourvu qu'un plus grand nombre puisse en bénéficier."]
[null,"Joël LEBOUCHER …Octobre 2015"]
[null,"un lien rompu ou devenu obsolète…..pas de panique…Google saura vous retrouver un document équivalent",null,null,null,null,null,null,null,null,null,null,null,null,null,"Fin"]

{"sheet":"Formats-Formules-Fonctions","index":12,"n_rows":226,"n_cols":27,"rows_kept":226,"cut":false,"hidden":false,"merged":[[181,2,181,4],[158,2,158,3],[165,2,165,3],[166,2,166,3],[169,2,169,5],[179,2,179,3],[180,2,180,3],[148,2,148,3],[42,21,43,21],[42,22,43,22],[42,23,43,23],[42,24,43,24],[42,16,43,16],[42,17,43,17],[42,18,43,18],[42,19,43,19],[42,20,43,20],[44,16,45,16],[44,17,45,26],[136,2,136,4],[139,2,139,4],[142,2,142,4],[40,21,41,21],[42,25,43,25],[42,26,43,26],[40,22,41,22],[40,23,41,23],[40,24,41,24],[40,25,41,25],[40,26,41,26],[40,16,41,16],[40,17,41,17],[40,18,41,18],[40,19,41,19],[40,20,41,20],[36,24,37,24],[36,25,37,25],[36,26,37,26],[38,16,39,16],[38,17,39,17],[38,18,39,18],[38,19,39,19],[38,20,39,20],[38,21,39,21],[38,22,39,22],[38,23,39,23],[38,24,39,24],[38,25,39,25],[38,26,39,26],[36,21,37,21],[36,22,37,22],[36,23,37,23],[33,19,35,19],[34,20,35,20],[34,21,35,21],[34,22,35,22],[34,23,35,23],[36,16,37,16],[36,17,37,17],[36,18,37,18],[36,19,37,19],[36,20,37,20],[19,1,22,14],[30,16,31,26],[32,16,32,19],[32,23,33,23],[32,24,33,24],[32,25,33,25],[32,26,33,26],[33,16,35,16],[33,17,35,17],[33,18,35,18],[34,25,35,25],[34,26,35,26],[34,24,35,24]]}
[{"$f":"CELL(\"largeur\",A1)","v":15},15,15,15,15,15,15,15,15,15,15,15,15,15,15,15,15,15,15,15,15,15,15,15,15,15,15]
[]
[null,"Quelques format - formules et fonctions ",null,null,null,null,null,null,null,null,null,null,null,null,null,"Mise à jour du 14 Décembre 2021"]
[null,"pour vous aider dans la conception de vos documents",null,null,null,null,null,null,null,null,null,null,null,null,null,"annule ou remplace les versions précédentes"]
[null,null,null,null,null,null,null,null,null,null,null,null,null,null,null,{"$f":"\"Page \"&_xlfn.SHEET()&\" sur \"&_xlfn.SHEETS()","v":"Page 13 sur 16"}]
[null,null,"des fonctions"]
[null,null,null,null,"à copier",null,"Fonction",null,null,null,null,"à copier",null,"Fonction"]
[null,null,null,"N° de colonne",{"$f":"COLUMN()","v":5},null,{"$f":"_xlfn.FORMULATEXT(E8)","v":"=COLONNE()"},null,null,null,"Adresse de cellule",{"$f":"ADDRESS(ROW(),COLUMN(),4)","v":"L8"},null,{"$f":"_xlfn.FORMULATEXT(L8)","v":"=ADRESSE(LIGNE();COLONNE();4)"}]
[null,null,null,null,"à copier",null,"Fonction",null,null,null,null,"à copier",null,"Fonction"]
[null,null,null,"N° de ligne",{"$f":"ROW()","v":10},null,{"$f":"_xlfn.FORMULATEXT(E10)","v":"=LIGNE()"},null,null,null,"largeur colonne",{"$f":"CELL(\"largeur\",L10)","v":15},null,{"$f":"_xlfn.FORMULATEXT(L10)","v":"=CELLULE(\"largeur\";L10)"}]
[null,null,null,null,"à copier",null,"Fonction"]
[null,null,null,"Adresse colonne",{"$f":"LEFT(ADDRESS(1,COLUMN(),4),LEN(ADDRESS(1,COLUMN(),4))-1)","v":"E"},null,{"$f":"_xlfn.FORMULATEXT(E12)","v":"=GAUCHE(ADRESSE(1;COLONNE();4);NBCAR(ADRESSE(1;COLONNE();4))-1)"}]
[null,null,null,null,null,null,null,null,null,null,null,{"$f":"\"Page \"&_xlfn.SHEET()&\" sur \"&_xlfn.SHEETS()","v":"Page 13 sur 16"},null,"Page &FEUILLE()&\" sur \"&FEUILLES()"]
[null,null,null,null,null,"à copier"]
[null,null,"Adresse classeur >",null,null,{"$f":"CELL(\"nomfichier\")","v":"E:\\0-UPRT\\1-UPRT.FR-SITE-WEB\\re-recettes-jean-marc-catteau\\re-catteau-galettes\\[GA-pate.sud.finistere.xlsm]Modes.d'emploi"}]
[null,null,null,null,null,{"$f":"_xlfn.FORMULATEXT(F15)","v":"=CELLULE(\"nomfichier\")"}]
[null,null,null,null,null,"Fonction"]
[]
[]
[null,"Pour récupérer des formules : 2 choix OU vous collez les 2 ou 3  lignes correspondantes dans votre feuille . OU vous cliquez dans la cellule de couleur , Copiez ...puis dans votre feuille : Collage spécial 1.2.3.Valeurs supprimez =  Modifiez les Numéros de cellules dans la barre de formule PUIS CLIQUEZ A LA FIN DE LA FORMULE AVANT d'ajouter de nouveau = (ce qui modifie votre valeur en fonction)  OU ajouter tout de suite = puis modifier les N° de cellules"]
[]
[]
[]
[]
[null,null,"pour copier ou modifier une formule supprimez le signe = puis ajoutez le lorsque vous aurez terminé"]
[null,null,"ce qui vous permettra de modifier en toute sécurité  - sans ce signe = Excel considère que c'est du texte"]
[]
[null,null,"Adresses","lien >","http://www.mdf-xlpages.com/modules/publisher/item.php?itemid=91"]
[]
[]
[null,null,null,null,null,null,null,null,null,null,null,null,null,null,null,null,"Aide mémoire : sur une  Équivalence litre / Kg"]
[null,"Ligne","Récupérer le nom du dossier (sans le chemin complet) "]
[null,null,{"$f":"MID(LEFT(CELL(\"filename\",A1),FIND(\"[\",CELL(\"filename\",A1))-2),SEARCH(\"µ\",SUBSTITUTE(LEFT(CELL(\"filename\",A1),FIND(\"[\",CELL(\"filename\",A1))-2),\"\\\",\"µ\",LEN(LEFT(CELL(\"filename\",A1),FIND(\"[\",CELL(\"filename\",A1))-2))-LEN(SUBSTITUTE(LEFT(CELL(\"filename\",A1),FIND(\"[\",CELL(\"filename\",A1))-2),\"\\\",\"\"))))+1,100)","v":"Téléchargements"},null,null,null,null,null,null,null,null,null,null,null,null,null,"sur la base eau : 1L = 1Kg ",null,null,null,null,null,null,"Kg","hg","dag","gr"]
[null,{"$f":"ROW()","v":34},{"$f":"_xlfn.FORMULATEXT(C33)","v":"=STXT(GAUCHE(CELLULE(\"filename\";A1);TROUVE(\"[\";CELLULE(\"filename\";A1))-2);CHERCHE(\"µ\";SUBSTITUE(GAUCHE(CELLULE(\"filename\";A1);TROUVE(\"[\";CELLULE(\"filename\";A1))-2);\"\\\";\"µ\";NBCAR(GAUCHE(CELLULE(\"filename\";A1);TROUVE(\"[\";CELLULE(\"filename\";A1))-2))-NBCAR(SUBSTITUE(GAUCHE(CELLULE(\"filename\";A1);TROUVE(\"[\";CELLULE(\"filename\";A1))-2);\"\\\";\"\"))))+1;100)"},null,null,null,null,null,null,null,null,null,null,null,".",null,"Litres (l.) ","Centilitres (cl.) ","Décilitres (dl.) ","Kilogrammes (kg.) "]
[null,null,"Copiez la cellule jaune puis collage spécial Valeurs 1 2 3 dans votre cellule et conservez \"A1\"",null,null,null,null,null,null,null,null,null,null,null,null,null,null,null,null,null,"Kg","cl","ml","L","dl","cl","ml"]
[]
[null,null,null,null,null,null,null,null,null,null,null,null,null,null,null,null,"1litre","100 cl","10 dl","1 kg","1 Kg","100 cl","1000 ml",1,"5","0","0"]
[null,"Ligne","Pour avoir le nom de l'onglet"]
[null,null,{"$f":"RIGHT(CELL(\"filename\",A1),LEN(CELL(\"filename\",A1))-SEARCH(\"]\",CELL(\"filename\",A1)))","v":"Formats-Formules-Fonctions"},null,null,null,null,null,null,null,null,null,null,null,null,null,"1/2 litre","50 cl","5 dl","0,500 kg","0.1Kg","10 cl","100 ml","0 ","5","0","0"]
[null,{"$f":"ROW()","v":40},{"$f":"_xlfn.FORMULATEXT(C39)","v":"=DROITE(CELLULE(\"filename\";A1);NBCAR(CELLULE(\"filename\";A1))-CHERCHE(\"]\";CELLULE(\"filename\";A1)))"}]
[null,null,"Copiez la cellule jaune puis collage spécial Valeurs 1 2 3 dans votre cellule et conservez \"A1\"",null,null,null,null,null,null,null,null,null,null,null,null,null,"1/4 litre","25 cl","2,5 dl","0,250 kg","0.01Kg","1 cl","10ml","0","0",5,"0"]
[]
[null,null,null,null,null,null,null,null,null,null,null,null,null,null,null,null,"1/8 litre","12, 5 c","1,25 dl","0,125 kg","0.001Kg","0.1 cl","1ml","0","0","0",5]
[null,"Ligne","Pour avoir le nom du fichier"]
[null,null,{"$f":"MID(CELL(\"filename\",A1),SEARCH(\"[\",CELL(\"filename\",A1))+1,SEARCH(\"]\",CELL(\"filename\",A1))-SEARCH(\"[\",CELL(\"filename\",A1))-1)","v":"GA-modele.de.fiche.pour.galettes.xlsm"},null,null,null,null,null,null,null,null,null,null,null,null,null,"Lien >","http://www.cuisinealafrancaise.com/fr/2-poids-et-mesures"]
[null,{"$f":"ROW()","v":46},{"$f":"_xlfn.FORMULATEXT(C45)","v":"{=STXT(CELLULE(\"filename\";A1);CHERCHE(\"[\";CELLULE(\"filename\";A1))+1;CHERCHE(\"]\";CELLULE(\"filename\";A1))-CHERCHE(\"[\";CELLULE(\"filename\";A1))-1)}"},null,null,null,null,null,null,null,null,null,null,null,"."]
[null,null,"Copiez la cellule jaune puis collage spécial Valeurs 1 2 3 dans votre cellule et conservez \"A1\"",null,null,null,null,null,null,null,null,null,null,null,null,null,null,"1 gr = 0.002Kg  > 2 zéros après la virgule du Kg"]
[]
[]
[null,"Ligne","Pour avoir le nom de l'onglet et du fichier"]
[null,null,{"$f":"RIGHT(CELL(\"filename\",A1),LEN(CELL(\"filename\",A1))-SEARCH(\"[\",CELL(\"filename\",A1))+1)","v":"[GA-modele.de.fiche.pour.galettes.xlsm]Formats-Formules-Fonctions"}]
[null,{"$f":"ROW()","v":52},{"$f":"_xlfn.FORMULATEXT(C51)","v":"=DROITE(CELLULE(\"filename\";A1);NBCAR(CELLULE(\"filename\";A1))-CHERCHE(\"[\";CELLULE(\"filename\";A1))+1)"}]
[null,null,"Copiez la cellule jaune puis collage spécial Valeurs 1 2 3 dans votre cellule et conservez \"A1\""]
[]
[]
[null,"Ligne","Pour avoir le nom du répertoire:"]
[null,null,{"$f":"LEFT(CELL(\"filename\",A1),SEARCH(\"[\",CELL(\"filename\",A1))-1)","v":"E:\\Joël Leboucher\\Téléchargements\\"}]
[null,{"$f":"ROW()","v":58},{"$f":"_xlfn.FORMULATEXT(C57)","v":"{=GAUCHE(CELLULE(\"filename\";A1);CHERCHE(\"[\";CELLULE(\"filename\";A1))-1)}"}]
[null,null,"Copiez la cellule jaune puis collage spécial Valeurs 1 2 3 dans votre cellule et conservez \"A1\""]
[]
[]
[null,"Ligne","Pour avoir le nom du répertoire et du fichier:"]
[null,null,{"$f":"LEFT(CELL(\"filename\",A1),SEARCH(\"]\",CELL(\"filename\",A1)))","v":"E:\\Joël Leboucher\\Téléchargements\\[GA-modele.de.fiche.pour.galettes.xlsm]"}]
[null,{"$f":"ROW()","v":64},{"$f":"_xlfn.FORMULATEXT(C63)","v":"{=GAUCHE(CELLULE(\"filename\";A1);CHERCHE(\"]\";CELLULE(\"filename\";A1)))}"}]
[null,null,"Copiez la cellule jaune puis collage spécial Valeurs 1 2 3 dans votre cellule et conservez \"A1\""]
[]
[]
[null,"Ligne","Afficher les formules avec une fonction"]
[null,{"$f":"ROW()","v":69},"FORMULETEXTE(B2)"]
[null,null,"Copiez la cellule jaune puis collage spécial Valeurs 1 2 3 dans votre cellule et modifiez le N°de cellule"]
[]
[]
[]
[]
[]
[null,"Ligne","pour s'assurer que le fichier est bien l'original, utiliser cette formule qui récupère le nom complet du fichier.  "]
[null,{"$f":"ROW()","v":77},{"$f":"CELL(\"nomfichier\")","v":"E:\\0-UPRT\\1-UPRT.FR-SITE-WEB\\re-recettes-jean-marc-catteau\\re-catteau-galettes\\[GA-pate.sud.finistere.xlsm]Modes.d'emploi"},null,null,null,null,null,null,null,null,null,null,"."]
[null,null,{"$f":"_xlfn.FORMULATEXT(C77)","v":"=CELLULE(\"nomfichier\")"}]
[null,null,"Copiez la cellule jaune puis collez la directement dans votre document"]
[]
[]
[null,"Ligne","pour marquer vos copies remplacez dans la formule les références en vert par les votres "]
[null,{"$f":"ROW()","v":83},"[ff-97-formats-formules-pourcentages.xlsx]sites\";\"\";\"ff-97-formats-formules-pourcentages COPIE\""]
[null,null,"Copiez la cellule verte puis collez la directement dans votre document"]
[]
[]
[null,"Ligne","Si vous avez besoin de retirer les crochets vous pouvez utiliser la fonction SUBSTITUE():"]
[null,null,{"$f":"SUBSTITUTE(SUBSTITUTE(RIGHT(CELL(\"filename\",A1),LEN(CELL(\"filename\",A1))-SEARCH(\"[\",CELL(\"filename\",A1))+1),\"[\",\"\"),\"]\",\" \")","v":"GA-modele.de.fiche.pour.galettes.xlsm Formats-Formules-Fonctions"}]
[null,{"$f":"ROW()","v":89},{"$f":"_xlfn.FORMULATEXT(C88)","v":"=SUBSTITUE(SUBSTITUE(DROITE(CELLULE(\"filename\";A1);NBCAR(CELLULE(\"filename\";A1))-CHERCHE(\"[\";CELLULE(\"filename\";A1))+1);\"[\";\"\");\"]\";\" \")"}]
[null,null,"Copiez la cellule jaune puis collage spécial Valeurs 1 2 3 dans votre cellule et conservez \"A1\""]
[]
[]
[null,"Ligne","Si vous souhaitez retirer les crochets:"]
[null,null,{"$f":"SUBSTITUTE(SUBSTITUTE(LEFT(CELL(\"filename\",A1),SEARCH(\"]\",CELL(\"filename\",A1))),\"[\",\"\"),\"]\",\"\")","v":"E:\\Joël Leboucher\\Téléchargements\\GA-modele.de.fiche.pour.galettes.xlsm"}]
[null,{"$f":"ROW()","v":95},{"$f":"_xlfn.FORMULATEXT(C94)","v":"=SUBSTITUE(SUBSTITUE(GAUCHE(CELLULE(\"filename\";A1);CHERCHE(\"]\";CELLULE(\"filename\";A1)));\"[\";\"\");\"]\";\"\")"}]
[null,null,"Copiez la cellule jaune puis collage spécial Valeurs 1 2 3 dans votre cellule et conservez \"A1\""]
[]
[]
[null,"Ligne","pour marquer vos documents"]
[null,null,{"$f":"IF(CELL(\"nomfichier\",C55)=\"\\\\rcg006bur\\usei_cartographie\\[ff-29-formats-formules-pourcentages.xlsx]sites\",\"\",\"ff-29-formats-formules-pourcentages COPIE\")","v":"ff-29-formats-formules-pourcentages COPIE"}]
[null,{"$f":"ROW()","v":101},{"$f":"_xlfn.FORMULATEXT(C100)","v":"=SI(CELLULE(\"nomfichier\";C55)=\"\\\\rcg006bur\\usei_cartographie\\[ff-29-formats-formules-pourcentages.xlsx]sites\";\"\";\"ff-29-formats-formules-pourcentages COPIE\")"}]
[null,null,"Copiez la cellule jaune puis collez la dans votre cellule ne changez pas le N° de cellule"]
[]
[]
[null,null,"Inverser la position du nom et du prénom"]
[null,"Ligne","il ne doit y avoir qu'un espace dans la chaine de caractères pour que cela fonctionne"]
[null,{"$f":"ROW()","v":107},"legendre paul ",null,{"$f":"RIGHT(C107,LEN(C107)-SEARCH(\" \",C107))&\" \"&LEFT(C107,SEARCH(\" \",C107))","v":"paul  legendre "}]
[null,null,null,null,{"$f":"_xlfn.FORMULATEXT(E107)","v":"=DROITE(C107;NBCAR(C107)-CHERCHE(\" \";C107))&\" \"&GAUCHE(C107;CHERCHE(\" \";C107))"}]
[null,null,null,null,"Copiez les 4 cellules encadrées puis collage dans votre feuille. Changez Nom et prénon dans la cellule fond noir "]
[]
[]
[null,null,"afficher le classement de toutes les cellules de la plage"]
[null,"Ligne"]
[null,{"$f":"ROW()","v":114},5,{"$f":"RANK(C114,C114:C118,0)","v":3},{"$f":"_xlfn.FORMULATEXT(D114)","v":"=RANG(C114;C114:C118;0)"}]
[null,null,8,{"$f":"RANK(C115,C114:C118,0)","v":1},"remplacer 1 par 0 pour avoir un ordre croissant"]
[null,null,4,{"$f":"RANK(C116,C114:C118,0)","v":4}]
[null,null,1,{"$f":"RANK(C117,C114:C118,0)","v":5}]
[null,null,7,{"$f":"RANK(C118,C114:C118,0)","v":2}]
[null,"Collez l'ensemble de ces cellules dans votre document et ajoutez des lignes. N'oubliez pas de figer par  votre plage"]
[]
[]
[null,null,"indiquer de façon visuelle le rang d'un nombre dans une série"]
[null,null,"la fonction Rang permet de déterminer la position d'un nombre dans une liste d'arguments"]
[null,null,"mais vous pouvez aussi y associer les fonctions REPT et CAR afin de donner un aspect visuel au résultat"]
[null,null,"si par exemple la série de nombre en colonne C"]
[null,"Ligne"]
[null,{"$f":"ROW()","v":127},5,{"$f":"REPT(CHAR(7),RANK(C127,C127:C131,1))","v":"\u0007\u0007\u0007"},{"$f":"_xlfn.FORMULATEXT(D127)","v":"=REPT(CAR(7);RANG(C127;C127:C131;1))"}]
[null,null,8,{"$f":"REPT(CHAR(7),RANK(C128,C127:C131,1))","v":"\u0007\u0007\u0007\u0007\u0007"}]
[null,null,4,{"$f":"REPT(CHAR(7),RANK(C129,C127:C131,1))","v":"\u0007\u0007"}]
[null,null,1,{"$f":"REPT(CHAR(7),RANK(C130,C127:C131,1))","v":"\u0007"}]
[null,null,7,{"$f":"REPT(CHAR(7),RANK(C131,C127:C131,1))","v":"\u0007\u0007\u0007\u0007"}]
[null,"Collez l'ensemble de ces cellules dans votre document et ajoutez des lignes. N'oubliez pas de figer par  votre plage"]
[]
[]
[null,null,"Dates - heures"]
[null,"Lignes"]
[null,{"$f":"ROW()","v":137},{"$f":"TODAY()","v":"2021-12-20"},null,null,null,{"$f":"_xlfn.FORMULATEXT(C137)","v":"=AUJOURDHUI()"}]
[null,null,"Format de cellule > Nombre > Date"]
[]
[null,{"$f":"ROW()","v":140},{"$f":"NOW()","v":"2021-12-20T19:39:32.240"},null,null,null,{"$f":"_xlfn.FORMULATEXT(C140)","v":"=MAINTENANT()"}]
[null,null,"Format de cellule > Nombre > Date"]
[]
[null,{"$f":"ROW()","v":143},{"$f":"NOW()","v":"2021-12-20T19:39:32.240"},null,null,null,{"$f":"_xlfn.FORMULATEXT(C143)","v":"=MAINTENANT()"}]
[null,null,null,"Format de cellule >","jjjj mm mmm aaaa - hh\"H\"mm"]
[]
[null,{"$f":"ROW()","v":146},{"$f":"NOW()","v":44550.819123148147},null,null,null,{"$f":"_xlfn.FORMULATEXT(C146)","v":"=MAINTENANT()"}]
[null,null,"Format de cellule > Nombre > Heure"]
[]
[null,{"$f":"ROW()","v":149},{"$f":"TODAY()","v":"2021-12-20"},null,null,null,{"$f":"_xlfn.FORMULATEXT(C149)","v":"=AUJOURDHUI()"}]
[null,null,"Format de cellule > Nombre > Date"]
[]
[]
[]
[null,null,"N° de semaine - collez les cellules vertes dans votre tableau"]
[null,"Lignes","collez les cellules vertes dans votre tableau"]
[null,{"$f":"ROW()","v":156},{"$f":"INT((C149-(DATE(YEAR(C149-WEEKDAY(C149-1)+4),1,3)-WEEKDAY(DATE(YEAR(C149 -WEEKDAY(C149-1)+4),1,3)))+5)/7)","v":51}]
[null,null,{"$f":"_xlfn.FORMULATEXT(C156)","v":"=ENT((C149-(DATE(ANNEE(C149-JOURSEM(C149-1)+4);1;3)-JOURSEM(DATE(ANNEE(C149 -JOURSEM(C149-1)+4);1;3)))+5)/7)"}]
[]
[null,{"$f":"ROW()","v":159},{"$f":"C156","v":51}]
[null,null,{"$f":"_xlfn.FORMULATEXT(C159)","v":"=C156"},"Format de cellule > Personnalisée > Semaine N °0"]
[]
[]
[]
[null,null,"afficher ler dernier vendredi du mois, pour une date saisie dans une autre cellule"]
[null,"Lignes","collez les cellules vertes dans votre tableau"]
[null,{"$f":"ROW()","v":166},"2020-11-05"]
[null,{"$f":"ROW()","v":167},{"$f":"DATE(YEAR(C166),MONTH(C166)+1,1)-WEEKDAY(DATE(YEAR(C166),MONTH(C166)+1,2))","v":"2020-11-27"}]
[null,null,{"$f":"_xlfn.FORMULATEXT(C167)","v":"=DATE(ANNEE(C166);MOIS(C166)+1;1)-JOURSEM(DATE(ANNEE(C166);MOIS(C166)+1;2))"}]
[]
[null,{"$f":"ROW()","v":170},{"$f":"DATE(YEAR(C166),MONTH(C166)+1,1)-WEEKDAY(DATE(YEAR(C166),MONTH(C166)+1,2))","v":"2020-11-27"}]
[null,null,{"$f":"_xlfn.FORMULATEXT(C170)","v":"=DATE(ANNEE(C166);MOIS(C166)+1;1)-JOURSEM(DATE(ANNEE(C166);MOIS(C166)+1;2))"}]
[null,null,"1;1=samedi",null,"1;5=mardi"]
[null,null,"1;2= vendredi",null,"1;6=lundi"]
[null,null,"1;3=jeudi",null,"1;7=dimanche"]
[null,null,"1;4=mercredi"]
[]
[]
[]
[null,"Lignes","autre solution"]
[null,{"$f":"ROW()","v":180},"2020-12-25"]
[null,{"$f":"ROW()","v":181},{"$f":"DATE(YEAR(C180),MONTH(C180)+1,1)-MOD(DATE(YEAR(C180),MONTH(C180)+1,1)+5,7)-3","v":44190},null,null,null,{"$f":"_xlfn.FORMULATEXT(C181)","v":"=DATE(ANNEE(C180);MOIS(C180)+1;1)-MOD(DATE(ANNEE(C180);MOIS(C180)+1;1)+5;7)-3"}]
[null,{"$f":"ROW()","v":182},{"$f":"DATE(YEAR(C180),MONTH(C180)+1,1)-MOD(DATE(YEAR(C180),MONTH(C180)+1,1)+5,7)-3","v":"2020-12-25"},null,null,null,"=DATE(ANNEE(C180);MOIS(C180)+1;1)-MOD(DATE(ANNEE(C180);MOIS(C180)+1;1)+5;7)-3"]
[null,null,"collez les cellules vertes dans votre tableau"]
[]
[]
[]
[]
[]
[]
[]
[]
[]
[]
[]
[null,null,"Pour une hauteur de 15 mm,vous pouvez donc régler sur 42,5."]
[null,null,"La largeur de colonne est mesurée en caractères standards. Valeur d'exemple par défaut, de 10,71 correspondant à 60 points."]
[null,null,"Vous pouvez donc régler : pour 50 mm => 25,29 ; pour 30 mm => 15,14 ; pour 10 mm => 5."]
[null,null,"Format pesonnalisé coller : +[bleu]Standard;-[rouge]Standard;\"\" ;Standard"]
[]
[]
[]
[]
[]
[]
[]
[null,null,null,null,null,null,null,null,null,null,"< = imprim écran avec Greenshot"]
[]
[null,null,null,null,null,null,null,null,null,null,"lien >","https://www.clubic.com/telecharger-fiche189780-greenshot.html"]
[]
[]
[]
[]
[]
[]
[]
[]
[]
[]
[]
[]
[]
[]
[null,"Transmettez votre savoir et votre savoir faire  peu importe qui le récupère; pourvu qu'un plus grand nombre puisse en bénéficier."]
[null,"Joël LEBOUCHER …Octobre 2015"]
[]
[null,"un lien rompu ou devenu obsolète…..pas de panique…Google saura vous retrouver un document équivalent"]

{"sheet":"Emoticones ","index":13,"n_rows":339,"n_cols":28,"rows_kept":339,"cut":false,"hidden":false,"merged":[[0,0,0,26]]}
["Copiez/Collez des émoticones dans vos documents",null,null,null,null,null,null,null,null,null,null,null,null,null,null,null,null,null,null,null,null,null,null,null,null,null,null,{"$f":"\"Page \"&_xlfn.SHEET()&\" sur \"&_xlfn.SHEETS()","v":"Page 14 sur 16"}]
[]
[null,null,"Insérer des émojis dans Excel"]
[null,null,"Lien>","https://www.excel-exercice.com/ajouter-des-emojis-emoticones-dans-vos-formules-feuilles-graphiques/",null,null,null,null,null,null,null,null,null,"Lien>","https://emojis.wiki/fr/",null,null,null,null,"Lien>","https://fr.emojiguide.com/nourriture-boissons/",null,null,null,null,"Lien>","https://www.facebook.com/GetEmoji/"]
[]
[null,null,"Lien>","https://emojiterra.com/fr/liste-fr/",null,null,null,null,null,null,null,null,null,"Lien>","https://www.emojiall.com/fr/all-emojis",null,null,null,null,"Lien>","https://emojiguide.org/fr/",null,null,null,null,"Lien>","http://www.get-emoji.com/"]
[]
[null,null,"Lien>","https://wprock.fr/t/emoji/",null,null,null,null,null,null,null,null,null,"Lien>","https://www.caracteres-speciaux.org/",null,null,null,null,"Lien>","https://emojipedia.org/",null,null,null,null,"Lien>","https://emojipedia.org/food-drink/"]
[]
[null,null,"Police > Segoe UI Emoji","🍏 🍎 🍐 🍊 🍋 🍌 🍉 🍇 🍓 🫐 🍈 🍒 🍑 🥭 🍍 🥥 🥝 🍅 🍆 🥑 🥦 🥬 🥒 🌶 🫑 🌽 🥕 🫒 🧄 🧅 🥔 🍠 🥐 🥯 🍞 🥖 🥨 🧀 🥚 🍳 🧈 🥞 🧇 🥓 🥩 🍗 🍖 🦴 🌭 🍔 🍟 🍕 🫓 🥪 🥙 🧆 🌮 🌯 🫔 🥗 🥘 🫕 🥫 🍝 🍜 🍲 🍛 🍣 🍱 🥟 🦪 🍤 🍙 🍚 🍘 🍥 🥠 🥮 🍢 🍡 🍧 🍨 🍦 🥧 🧁 🍰 🎂 🍮 🍭 🍬 🍫 🍿 🍩 🍪 🌰 🥜 🍯 🥛 🍼 🫖 ☕️ 🍵 🧃 🥤 🧋 🍶 🍺 🍻 🥂 🍷 🥃 🍸 🍹 🧉 🍾 🧊 🥄 🍴 🍽 🥣 🥡 🥢 🧂"]
[]
[null,null,"Police > Segoe UI Emoji","🚾 ♿️ 🅿️ 🛗 🈳 🈂️ 🛂 🛃 🛄 🛅 🚹 🚺 🚼 ⚧ 🚻 🚮 🎦 📶 🈁 🔣 ℹ️ 🔤 🔡 🔠 🆖 🆗 🆙 🆒 🆕 🆓 0️⃣ 1️⃣ 2️⃣ 3️⃣ 4️⃣ 5️⃣ 6️⃣ 7️⃣ 8️⃣ 9️⃣ 🔟 🔢 #️⃣ *️⃣ ⏏️ ▶️ ⏸ ⏯ ⏹ ⏺ ⏭ ⏮ ⏩ ⏪ ⏫ ⏬ ◀️ 🔼 🔽 ➡️ ⬅️ ⬆️ ⬇️ ↗️ ↘️ ↙️ ↖️ ↕️ ↔️ ↪️ ↩️ ⤴️ ⤵️ 🔀 🔁 🔂 🔄 🔃 🎵 🎶 ➕ ➖ ➗ ✖️ "]
[]
[null,null,null,"🤢","🥴",null,null,"🥱","😁","😃",null,null,"😂","🤓",null,"😴",null,null,null,null,null,null,null,"👨‍🍳",null,null,null,"< images"]
[]
[1,"26BD","⚽","ballon de football",null,325,"1F37E","🍾","bouteille avec bouchon éclatant",null,649,"1F4CF","📏","règle droite",null,973,"1F6BA","🚺","chambre des femmes",null,"Comment insérer des émojis avec la formule UNICAR() d’Excel"]
[2,"26BE","⚾","base-ball",null,326,"1F37F","🍿","pop-corn",null,650,"1F4D0","📐","règle triangulaire",null,974,"1F6BB","🚻","toilettes",null,"Lien>","https://www.youtube.com/watch?v=6YvO8zQjX6Y"]
[3,"23F8","⏸","bouton pause",null,327,"1F380","🎀","ruban",null,651,"1F4D1","📑","onglets de signets",null,975,"1F6BC","🚼","symbole bébé",null,"Insérer des émojis dans Excel"]
[4,"23F9","⏹","bouton d’arrêt",null,328,"1F381","🎁","cadeau emballé",null,652,"1F4D2","📒","grand livre",null,976,"1F6BD","🚽","toilette",null,"Lien>","https://www.excel-exercice.com/ajouter-des-emojis-emoticones-dans-vos-formules-feuilles-graphiques/"]
[5,"23FA","⏺","bouton d’enregistrement",null,329,"1F382","🎂","gâteau d'anniversaire",null,653,"1F4D3","📓","carnet de notes",null,977,"1F6BE","🚾","WC",null,null,"Le plus simple c'est d'utiliser le clavier virtuel ou visuel de Windows 10."]
[6,2795,"➕","plus",null,330,"1F383","🎃","jack-o-lantern",null,654,"1F4D4","📔","carnet avec couverture décorative",null,978,"1F6BF","🚿","douche"]
[7,2796,"➖","moins",null,331,"1F384","🎄","Arbre de Noël",null,655,"1F4D5","📕","livre fermé",null,979,"1F6C0","🛀","personne prenant un bain"]
[8,2797,"➗","diviser",null,332,"1F385","🎅","Père Noël",null,656,"1F4D6","📖","livre ouvert",null,980,"1F6C1","🛁","baignoire",null,"Comment utiliser les émoticônes sur Windows 10"]
[9,"27B0","➰","boucle bouclée",null,333,"1F386","🎆","feu d’artifice",null,657,"1F4D7","📗","livre vert",null,981,"1F6C2","🛂","contrôle des passeports",null,". Appuyez sur l'un de ces raccourcis clavier :"]
[10,"27BF","➿",null,null,334,"1F387","🎇","Cierge",null,658,"1F4D8","📘","livre bleu",null,982,"1F6C3","🛃","douane",null,null,"Touche Windows et point/touche d'arrêt ( . )"]
[11,"FE0F","️",null,null,335,"1F388","🎈","ballon",null,659,"1F4D9","📙","livre orange",null,983,"1F6C4","🛄","Bagages",null,null,"ou Touche Windows et touche point-virgule ( ; )"]
[12,3030,"〰",null,null,336,"1F389","🎉","popper de fête",null,660,"1F4DA","📚","Livres",null,984,"1F6C5","🛅","consigne à bagages"]
[13,"303D","〽",null,null,337,"1F38A","🎊","boule de confettis",null,661,"1F4DB","📛","badge nominatif",null,985,"1F6CB","🛋","canapé et lampe"]
[14,"203C","‼",null,null,338,"1F38B","🎋","arbre tanabata",null,662,"1F4DC","📜","faire défiler",null,986,"1F6CC","🛌","personne au lit"]
[15,2049,"⁉",null,null,339,"1F38C","🎌","drapeaux croisés",null,663,"1F4DD","📝","mémo",null,987,"1F6CD","🛍","sacs à provisions"]
[16,"2B1B","⬛",null,null,340,"1F38D","🎍","décoration en pin",null,664,"1F4DE","📞","récepteur téléphonique",null,988,"1F6CE","🛎","cloche"]
[17,"2B1C","⬜",null,null,341,"1F38E","🎎","Poupées japonaises",null,665,"1F4DF","📟","téléavertisseur",null,989,"1F6CF","🛏","lit"]
[18,"23EA","⏪",null,null,342,"1F38F","🎏","streamer de carpes",null,666,"1F4E0","📠","télécopieur",null,990,"1F6D0","🛐","lieu de culte"]
[19,"23EB","⏫",null,null,343,"1F390","🎐","carillon éolien",null,667,"1F4E1","📡","antenne satellite",null,991,"1F6D1","🛑","Panneau stop"]
[20,"23EC","⏬",null,null,344,"1F391","🎑","cérémonie d’observation de la lune",null,668,"1F4E2","📢","haut-parleur",null,992,"1F6D2","🛒","caddie"]
[21,"23ED","⏭",null,null,345,"1F392","🎒","sac à dos",null,669,"1F4E3","📣","mégaphone",null,993,"1F6D5","🛕","temple hindou"]
[22,"23EE","⏮",null,null,346,"1F393","🎓","casquette de graduation",null,670,"1F4E4","📤","bac d’envoi",null,994,"1F6D6","🛖","hutte"]
[23,"23EF","⏯",null,null,347,"1F396","🎖","médaille militaire",null,671,"1F4E5","📥","bac de la boîte de réception",null,995,"1F6D7","🛗","ascenseur"]
[24,"23F0","⏰","réveille-matin",null,348,"1F397","🎗","ruban de rappel",null,672,"1F4E6","📦","colis",null,996,"1F6DD","🛝"]
[25,"23F1","⏱","chronomètre",null,349,"1F399","🎙","microphone de studio",null,673,"1F4E7","📧","Messagerie électronique",null,997,"1F6DE","🛞"]
[26,"23F2","⏲","chronomètre",null,350,"1F39A","🎚","curseur de niveau",null,674,"1F4E8","📨","enveloppe entrante",null,998,"1F6DF","🛟"]
[27,"23F3","⏳","horloge de minuterie",null,351,"1F39B","🎛","boutons de commande",null,675,"1F4E9","📩","enveloppe avec flèche",null,999,"1F6E0","🛠","marteau et clé"]
[28,"231A","⌚","sablier pas fait",null,352,"1F39E","🎞","cadres de film",null,676,"1F4EA","📪","boîte aux lettres fermée avec indicateur abaissé",null,1000,"1F6E1","🛡","bouclier"]
[29,"231B","⌛","montre",null,353,"1F39F","🎟","billets d’entrée",null,677,"1F4EB","📫","boîte aux lettres fermée avec indicateur levé",null,1001,"1F6E2","🛢","tambour d’huile"]
[30,2328,"⌨","sablier fait",null,354,"1F3A0","🎠","cheval de carrousel",null,678,"1F4EC","📬","ouvrir une boîte aux lettres avec un indicateur en relief",null,1002,"1F6E3","🛣","autoroute"]
[31,2935,"⤵","clavier",null,355,"1F3A1","🎡","grande roue",null,679,"1F4ED","📭","ouvrir une boîte aux lettres avec un indicateur abaissé",null,1003,"1F6E4","🛤","voie ferrée"]
[32,2934,"⤴","flèche droite courbée vers le bas",null,356,"1F3A2","🎢","montagnes russes",null,680,"1F4EE","📮","Postbox",null,1004,"1F6E5","🛥","bateau à moteur"]
[33,"2B05","⬅","flèche droite courbée vers le haut",null,357,"1F3A3","🎣","canne à pêche",null,681,"1F4EF","📯","corne postale",null,1005,"1F6E9","🛩","petit avion"]
[34,"2B06","⬆","flèche gauche",null,358,"1F3A4","🎤","microphone",null,682,"1F4F0","📰","journal",null,1006,"1F6EB","🛫","départ de l’avion"]
[35,"2B07","⬇","flèche vers le haut",null,359,"1F3A5","🎥","caméra",null,683,"1F4F1","📱","téléphone mobile",null,1007,"1F6EC","🛬","arrivée en avion"]
[36,"25AA","▪","flèche vers le bas",null,360,"1F3A6","🎦","cinéma",null,684,"1F4F2","📲","téléphone mobile avec flèche",null,1008,"1F6F0","🛰","satellite"]
[37,"25AB","▫","petit carré noir",null,361,"1F3A7","🎧","écouteur",null,685,"1F4F3","📳","mode de vibration",null,1009,"1F6F3","🛳","Paquebot"]
[38,"25B6","▶","bouton de lecture",null,362,"1F3A8","🎨","palette d’artistes",null,686,"1F4F4","📴","téléphone portable éteint",null,1010,"1F6F4","🛴","trottinette"]
[39,"25C0","◀","bouton d’inversion",null,363,"1F3A9","🎩","top a",null,687,"1F4F5","📵","pas de téléphones portables",null,1011,"1F6F5","🛵","scooter"]
[40,"261D","☝","index pointant vers le haut",null,364,"1F3AA","🎪","tente de cirque",null,688,"1F4F6","📶","barres d’antenne",null,1012,"1F6F6","🛶","canoë"]
[41,2197,"↗","flèche haut-droite",null,365,"1F3AB","🎫","billet",null,689,"1F4F7","📷","caméra",null,1013,"1F6F7","🛷","traîneau"]
[42,"21AA","↪","flèche gauche courbée vers la droite",null,366,"1F3AC","🎬","clapper board",null,690,"1F4F8","📸","appareil photo avec flash",null,1014,"1F6F8","🛸","soucoupe volante"]
[43,"27A1","➡","flèche droite",null,367,"1F3AD","🎭","arts du spectacle",null,691,"1F4F9","📹","caméra vidéo",null,1015,"1F6F9","🛹","skateboard"]
[44,2198,"↘","flèche vers le bas à droite",null,368,"1F3AE","🎮","jeu vidéo",null,692,"1F4FA","📺","télévision",null,1016,"1F6FA","🛺","pousse-pousse automobile"]
[45,2199,"↙"," vers le bas à gauche",null,369,"1F3AF","🎯","Bulle",null,693,"1F4FB","📻","radio",null,1017,"1F6FB","🛻","pick-up"]
[46,"21A9","↩","flèche droite courbée vers la gauche",null,370,"1F3B0","🎰","Machine",null,694,"1F4FC","📼","Vidéos",null,1018,"1F6FC","🛼","patin à roulettes"]
[47,2196,"↖","flèche haut-gauche",null,371,"1F3B1","🎱","piscine 8 boule",null,695,"1F4FD","📽","projecteur de film",null,1019,"1F7E0","🟠","cercle orange"]
[48,2194,"↔","flèche gauche-droite",null,372,"1F3B2","🎲","dé de jeu",null,696,"1F4FF","📿","chapelet",null,1020,"1F7E1","🟡","cercle jaune"]
[49,2195,"↕","flèche haut-bas",null,373,"1F3B3","🎳","bowling",null,697,"1F500","🔀","bouton de lecture aléatoire des pistes",null,1021,"1F7E2","🟢","cercle vert"]
[50,"00A9","©","copyright",null,374,"1F3B4","🎴","cartes à jouer de fleurs",null,698,"1F501","🔁","bouton répéter",null,1022,"1F7E3","🟣","cercle violet"]
[51,"00AE","®","recommandé",null,375,"1F3B5","🎵","note de musique",null,699,"1F502","🔂","répéter un seul bouton",null,1023,"1F7E4","🟤","cercle brun"]
[52,2600,"☀","soleil",null,376,"1F3B6","🎶","notes de musique",null,700,"1F503","🔃","flèches verticales dans le sens des aiguilles d’une montre",null,1024,"1F7E5","🟥","carré rouge"]
[53,2601,"☁","nuage",null,377,"1F3B7","🎷","saxophone",null,701,"1F504","🔄","bouton flèches dans le sens inverse des aiguilles d’une montre",null,1025,"1F7E6","🟦","carré bleu"]
[54,2602,"☂","parapluie",null,378,"1F3B8","🎸","guitare",null,702,"1F505","🔅","bouton dim",null,1026,"1F7E7","🟧","carré orange"]
[55,2603,"☃","bonhomme de neige",null,379,"1F3B9","🎹","clavier musical",null,703,"1F506","🔆","bouton lumineux",null,1027,"1F7E8","🟨","carré jaune"]
[56,2604,"☄","comète",null,380,"1F3BA","🎺","trompette",null,704,"1F507","🔇","haut-parleur muet",null,1028,"1F7E9","🟩","carré vert"]
[57,"260E","☎","téléphone",null,381,"1F3BB","🎻","violon",null,705,"1F508","🔈"," à faible volume",null,1029,"1F7EA","🟪","carré violet"]
[58,2611,"☑","case à cocher avec coche",null,382,"1F3BC","🎼","partition musicale",null,706,"1F509","🔉","haut-parleur volume moyen",null,1030,"1F7EB","🟫","carré brun"]
[59,2620,"☠","crâne et os croisés",null,383,"1F3BD","🎽","chemise de course",null,707,"1F50A","🔊","haut-parleur volume élevé",null,1031,"1F7F0","🟰"]
[60,2622,"☢","radioactif",null,384,"1F3BE","🎾","tennis",null,708,"1F50B","🔋","pile",null,1032,"1F90C","🤌","doigts pincés"]
[61,2623,"☣","Biohazard",null,385,"1F3BF","🎿","Skis",null,709,"1F50C","🔌","prise électrique",null,1033,"1F90D","🤍","cœur blanc"]
[62,2626,"☦","croix orthodoxe",null,386,"1F3C0","🏀","basket-ball",null,710,"1F50D","🔍","loupe inclinée vers la gauche",null,1034,"1F90E","🤎","cœur brun"]
[63,"262A","☪","étoile et croissant",null,387,"1F3C1","🏁","drapeau à damier",null,711,"1F50E","🔎","loupe inclinée vers la droite",null,1035,"1F90F","🤏","pincement de la main"]
[64,"262E","☮"," de paix",null,388,"1F3C2","🏂","snowboarder",null,712,"1F50F","🔏","verrouillé avec un stylo",null,1036,"1F910","🤐","zipper-bouche visage"]
[65,"262F","☯","Yin Yang",null,389,"1F3C3","🏃","personne qui court",null,713,"1F510","🔐","verrouillé avec clé",null,1037,"1F911","🤑","visage de bouche d’argent"]
[66,2638,"☸","roue du dharma",null,390,"1F3C4","🏄","personne surfant",null,714,"1F511","🔑","clé",null,1038,"1F912","🤒","visage avec thermomètre"]
[67,2639,"☹","visage fronçant les sourcils",null,391,"1F3C5","🏅","médaille sportive",null,715,"1F512","🔒","verrouillé",null,1039,"1F913","🤓","visage de nerd"]
[68,"263A","☺","visage souriant",null,392,"1F3C6","🏆","trophée",null,716,"1F513","🔓","déverrouillé",null,1040,"1F914","🤔","visage pensant"]
[69,2640,"♀","signe féminin",null,393,"1F3C7","🏇","courses de chevaux",null,717,"1F514","🔔","cloche",null,1041,"1F915","🤕","visage avec bandage de tête"]
[70,2642,"♂","signe masculin",null,394,"1F3C8","🏈","football américain",null,718,"1F515","🔕","cloche avec barre oblique",null,1042,"1F916","🤖","robot"]
[71,2648,"♈","Bélier",null,395,"1F3C9","🏉","rugby à XV",null,719,"1F516","🔖","Signet",null,1043,"1F917","🤗","visage souriant avec les mains ouvertes"]
[72,2649,"♉","Taureau",null,396,"1F3CA","🏊","personne nageant",null,720,"1F517","🔗","lien",null,1044,"1F918","🤘","signe des cornes"]
[73,"264A","♊","Gémeaux",null,397,"1F3CB","🏋","personne soulevant des poids",null,721,"1F518","🔘","bouton radio",null,1045,"1F919","🤙","appelez-moi la main"]
[74,"264B","♋","Cancer",null,398,"1F3CC","🏌","personne golfeur",null,722,"1F519","🔙","Flèche RETOUR",null,1046,"1F91A","🤚","le dos levé de la main"]
[75,"264C","♌","Lion",null,399,"1F3CD","🏍","motocyclette",null,723,"1F51A","🔚","Flèche END",null,1047,"1F91B","🤛","poing tourné vers la gauche"]
[76,"264D","♍","Vierge",null,400,"1F3CE","🏎","voiture de course",null,724,"1F51B","🔛","SUR! flèche",null,1048,"1F91C","🤜","poing droit"]
[77,"264E","♎","Piler",null,401,"1F3CF","🏏","jeu de cricket",null,725,"1F51C","🔜","Flèche SOON",null,1049,"1F91D","🤝","poignée de main"]
[78,"264F","♏","Scorpion",null,402,"1F3D0","🏐","volley-ball",null,726,"1F51D","🔝","Flèche HAUT",null,1050,"1F91E","🤞","croisons les doigts"]
[79,2650,"♐","Sagittaire",null,403,"1F3D1","🏑","hockey sur gazon",null,727,"1F51E","🔞","personne de moins de dix-huit ans",null,1051,"1F91F","🤟","geste d’amour-toi"]
[80,2651,"♑","Capricorne",null,404,"1F3D2","🏒","hockey sur glace",null,728,"1F51F","🔟","keycap: 10",null,1052,"1F920","🤠","visage de chapeau de cow-boy"]
[81,2652,"♒","Verseau",null,405,"1F3D3","🏓","ping-pong",null,729,"1F520","🔠","entrée latin majuscule",null,1053,"1F921","🤡","visage de clown"]
[82,2653,"♓","Poissons",null,406,"1F3D4","🏔","montagne enneigée",null,730,"1F521","🔡","entrée latin minuscule",null,1054,"1F922","🤢","visage nauséeux"]
[83,"265F","♟","pion d’échecs",null,407,"1F3D5","🏕","camping",null,731,"1F522","🔢","numéros d’entrée",null,1055,"1F923","🤣","se rouler sur le sol en riant"]
[84,2660,"♠","costume de bêche",null,408,"1F3D6","🏖","plage avec parasol",null,732,"1F523","🔣","symboles d’entrée",null,1056,"1F924","🤤","visage bave"]
[85,2663,"♣","costume club",null,409,"1F3D7","🏗","construction de bâtiments",null,733,"1F524","🔤","saisir des lettres latines",null,1057,"1F925","🤥","visage couché"]
[86,2665,"♥","costume de cœur",null,410,"1F3D8","🏘","Maisons",null,734,"1F525","🔥","Feu",null,1058,"1F926","🤦","personne facepalming"]
[87,2666,"♦","costume diamant",null,411,"1F3D9","🏙","Cityscape",null,735,"1F526","🔦","torche",null,1059,"1F927","🤧","éternuements du visage"]
[88,2668,"♨","sources chaudes",null,412,"1F3DA","🏚","maison abandonnée",null,736,"1F527","🔧","clé",null,1060,"1F928","🤨","visage avec sourcil levé"]
[89,2702,"✂","ciseaux",null,413,"1F3DB","🏛","bâtiment classique",null,737,"1F528","🔨","marteau",null,1061,"1F929","🤩","frappé par une étoile"]
[90,2708,"✈","avion",null,414,"1F3DC","🏜","désert",null,738,"1F529","🔩","écrou et boulon",null,1062,"1F92A","🤪","visage loufoque"]
[91,2709,"✉","enveloppe",null,415,"1F3DD","🏝","île déserte",null,739,"1F52A","🔪","couteau de cuisine",null,1063,"1F92B","🤫","visage qui s’était"]
[92,"270C","✌","main de la victoire",null,416,"1F3DE","🏞","parc national",null,740,"1F52B","🔫","pistolet à eau",null,1064,"1F92C","🤬","visage avec des symboles sur la bouche"]
[93,"270D","✍","écrire la main",null,417,"1F3DF","🏟","stade",null,741,"1F52C","🔬","microscope",null,1065,"1F92D","🤭","visage avec la main sur la bouche"]
[94,"270F","✏","crayon",null,418,"1F3E0","🏠","maison",null,742,"1F52D","🔭","télescope",null,1066,"1F92E","🤮","vomissements au visage"]
[95,2712,"✒","plume noire",null,419,"1F3E1","🏡","maison avec jardin",null,743,"1F52E","🔮","boule de cristal",null,1067,"1F92F","🤯","tête qui explose"]
[96,2714,"✔","coche",null,420,"1F3E2","🏢"," de bureaux",null,744,"1F52F","🔯","étoile pointillée à six branches",null,1068,"1F930","🤰","femme enceinte"]
[97,2716,"✖","multiplier",null,421,"1F3E3","🏣","Bureau de poste japonais",null,745,"1F530","🔰","Symbole japonais pour débutant",null,1069,"1F931","🤱","l’allaitement"]
[98,"271D","✝","croix latine",null,422,"1F3E4","🏤","bureau de poste",null,746,"1F531","🔱","emblème du trident",null,1070,"1F932","🤲","paumes ensemble"]
[99,2721,"✡","étoile de David",null,423,"1F3E5","🏥","hôpital",null,747,"1F532","🔲","bouton carré noir",null,1071,"1F933","🤳","selfie"]
[100,2733,"✳","astérisque à huit rayons",null,424,"1F3E6","🏦","banque",null,748,"1F533","🔳","bouton carré blanc",null,1072,"1F934","🤴","prince"]
[101,2734,"✴","étoile à huit branches",null,425,"1F3E7","🏧","Panneau ATM",null,749,"1F534","🔴","cercle rouge",null,1073,"1F935","🤵","personne en smoking"]
[102,2744,"❄","flocon de neige",null,426,"1F3E8","🏨","hôtel",null,750,"1F535","🔵","cercle bleu",null,1074,"1F936","🤶","Mme Claus"]
[103,2747,"❇","scintiller",null,427,"1F3E9","🏩","love hôtel",null,751,"1F536","🔶","grand diamant orange",null,1075,"1F937","🤷","personne haussant les épaules"]
[104,"274E","❎","bouton de marque croisée",null,428,"1F3EA","🏪","dépanneur",null,752,"1F537","🔷","grand diamant bleu",null,1076,"1F938","🤸","chariot de personne"]
[105,2753,"❓","point d’interrogation rouge",null,429,"1F3EB","🏫","école",null,753,"1F538","🔸","petit diamant orange",null,1077,"1F939","🤹","personne jonglant"]
[106,2754,"❔","point d’interrogation blanc",null,430,"1F3EC","🏬","grand magasin",null,754,"1F539","🔹","petit diamant bleu",null,1078,"1F93A","🤺","personne escrime"]
[107,2755,"❕","point d’exclamation blanc",null,431,"1F3ED","🏭","usine",null,755,"1F53A","🔺","triangle rouge pointé vers le haut",null,1079,"1F93C","🤼","les gens luttent"]
[108,2757,"❗","point d’exclamation rouge",null,432,"1F3EE","🏮","lanterne en papier rouge",null,756,"1F53B","🔻","triangle rouge pointé vers le bas",null,1080,"1F93D","🤽","personne jouant au water-polo"]
[109,2763,"❣","exclamation du cœur",null,433,"1F3EF","🏯","Château japonais",null,757,"1F53C","🔼","bouton vers le haut",null,1081,"1F93E","🤾","personne jouant au handball"]
[110,2764,"❤","cœur rouge",null,434,"1F3F0","🏰","château",null,758,"1F53D","🔽","bouton vers le bas",null,1082,"1F93F","🤿","masque de plongée"]
[111,2705,"✅","bouton de coche",null,435,"1F3F3","🏳","drapeau blanc",null,759,"1F549","🕉","À",null,1083,"1F940","🥀","fleur fanée"]
[112,"270A","✊","poing levé",null,436,"1F3F4","🏴","drapeau noir",null,760,"1F54A","🕊","où",null,1084,"1F941","🥁","tambour"]
[113,"270B","✋","main levée",null,437,"1F3F5","🏵","rosette",null,761,"1F54B","🕋","Kaaba",null,1085,"1F942","🥂","lunettes qui clignotent"]
[114,2728,"✨","Étincelles",null,438,"1F3F7","🏷","étiquette",null,762,"1F54C","🕌","mosquée",null,1086,"1F943","🥃","verre tumbler"]
[115,"274C","❌","marque croisée",null,439,"1F3F8","🏸","badminton",null,763,"1F54D","🕍","synagogue",null,1087,"1F944","🥄","cuiller"]
[116,2614,"☔","parapluie avec gouttes de pluie",null,440,"1F3F9","🏹","arc et flèche",null,764,"1F54E","🕎","ménorah",null,1088,"1F945","🥅","but net"]
[117,2615,"☕","boisson chaude",null,441,"1F3FA","🏺","amphore",null,765,"1F550","🕐","une heure",null,1089,"1F947","🥇","Médaille de 1ère place"]
[118,"267B","♻","symbole de recyclage",null,442,"1F400","🐀","rat",null,766,"1F551","🕑","deux heures",null,1090,"1F948","🥈","Médaille de 2e place"]
[119,"23CF","⏏","bouton d’éjection",null,443,"1F401","🐁","souris",null,767,"1F552","🕒","trois heures",null,1091,"1F949","🥉","Médaille de 3ème place"]
[120,"25FB","◻","carré moyen blanc",null,444,"1F402","🐂","bœuf",null,768,"1F553","🕓","quatre heures",null,1092,"1F94A","🥊","gant de boxe"]
[121,"25FC","◼","carré moyen noir",null,445,"1F403","🐃","buffle d'Asie",null,769,"1F554","🕔","cinq heures",null,1093,"1F94B","🥋","uniforme d’arts martiaux"]
[122,"25FD","◽","carré blanc moyen-petit",null,446,"1F404","🐄","vache",null,770,"1F555","🕕","six heures",null,1094,"1F94C","🥌","pierre de curling"]
[123,"25FE","◾","noir moyen-petit carré",null,447,"1F405","🐅","tigre",null,771,"1F556","🕖","sept heures",null,1095,"1F94D","🥍","lacrosse"]
[124,"26A0","⚠","avertissement",null,448,"1F406","🐆","léopard",null,772,"1F557","🕗","huit heures",null,1096,"1F94E","🥎","softball"]
[125,"26A1","⚡","haute tension",null,449,"1F407","🐇","lapin",null,773,"1F558","🕘","neuf heures",null,1097,"1F94F","🥏","disque volant"]
[126,2618,"☘","trèfle",null,450,"1F408","🐈","chat",null,774,"1F559","🕙","dix heures",null,1098,"1F950","🥐","croissant"]
[127,"267E","♾","Infini",null,451,"1F409","🐉","dragon",null,775,"1F55A","🕚","onze heures",null,1099,"1F951","🥑","avocat"]
[128,"267F","♿","symbole de fauteuil roulant",null,452,"1F40A","🐊","crocodile",null,776,"1F55B","🕛","Midi",null,1100,"1F952","🥒","concombre"]
[129,2692,"⚒","marteau et pic",null,453,"1F40B","🐋","baleine",null,777,"1F55C","🕜","un-trente",null,1101,"1F953","🥓","lard"]
[130,2693,"⚓","ancre",null,454,"1F40C","🐌","escargot",null,778,"1F55D","🕝","deux-trente",null,1102,"1F954","🥔","pomme de terre"]
[131,2694,"⚔",null,null,455,"1F40D","🐍","serpent",null,779,"1F55E","🕞","trois-trente",null,1103,"1F955","🥕","carotte"]
[132,2695,"⚕",null,null,456,"1F40E","🐎","cheval",null,780,"1F55F","🕟","quatre-trente",null,1104,"1F956","🥖","pain baguette"]
[133,2696,"⚖",null,null,457,"1F40F","🐏","bélier",null,781,"1F560","🕠","cinq-trente",null,1105,"1F957","🥗","salade verte"]
[134,2697,"⚗",null,null,458,"1F410","🐐","chèvre",null,782,"1F561","🕡","six-trente",null,1106,"1F958","🥘","casserole peu profonde de nourriture"]
[135,2699,"⚙","engrenage",null,459,"1F411","🐑","brebis",null,783,"1F562","🕢","sept-trente",null,1107,"1F959","🥙","pain plat farci"]
[136,"269B","⚛","symbole d’atome",null,460,"1F412","🐒","singe",null,784,"1F563","🕣","huit-trente",null,1108,"1F95A","🥚","oeuf"]
[137,"269C","⚜","fleur-de-lis",null,461,"1F413","🐓","coq",null,785,"1F564","🕤","neuf-trente",null,1109,"1F95B","🥛","verre de lait"]
[138,"26A7","⚧","symbole transgenre",null,462,"1F414","🐔","poulet",null,786,"1F565","🕥","dix-trente",null,1110,"1F95C","🥜","cacahuètes"]
[139,"26AA","⚪","cercle blanc",null,463,"1F415","🐕","chien",null,787,"1F566","🕦","onze-trente",null,1111,"1F95D","🥝","kiwi"]
[140,"26AB","⚫","cercle noir",null,464,"1F416","🐖","cochon",null,788,"1F567","🕧","douze-trente",null,1112,"1F95E","🥞","Crêpes"]
[141,"26B0","⚰","cercueil",null,465,"1F417","🐗","verrat",null,789,"1F56F","🕯","bougie",null,1113,"1F95F","🥟","boulette"]
[142,"26B1","⚱","urne funéraire",null,466,"1F418","🐘","éléphant",null,790,"1F570","🕰","horloge de cheminée",null,1114,"1F960","🥠","Biscuit"]
[143,"26C4","⛄","bonhomme de neige sans neige",null,467,"1F419","🐙","pieuvre",null,791,"1F573","🕳","trou",null,1115,"1F961","🥡","boîte à emporter"]
[144,"26C5","⛅","soleil derrière les nuages",null,468,"1F41A","🐚","coquille en spirale",null,792,"1F574","🕴","personne en costume en lévitation",null,1116,"1F962","🥢","baguettes"]
[145,"26C8","⛈","nuage avec la foudre et la pluie",null,469,"1F41B","🐛","punaise",null,793,"1F575","🕵","détective",null,1117,"1F963","🥣","bol avec cuillère"]
[146,"26CE","⛎","Ophiuchus",null,470,"1F41C","🐜","sur",null,794,"1F576","🕶","lunettes de soleil",null,1118,"1F964","🥤","tasse avec paille"]
[147,"26CF","⛏","cueillir",null,471,"1F41D","🐝","abeille",null,795,"1F577","🕷","araignée",null,1119,"1F965","🥥","noix de coco"]
[148,"26D1","⛑","casque de secouriste",null,472,"1F41E","🐞","coccinelle",null,796,"1F578","🕸","toile d’araignée",null,1120,"1F966","🥦","brocoli"]
[149,"26D3","⛓","enchaîne",null,473,"1F41F","🐟","poisson",null,797,"1F579","🕹","joystick",null,1121,"1F967","🥧","pied"]
[150,"26D4","⛔","entrée interdite",null,474,"1F420","🐠","poissons tropicaux",null,798,"1F57A","🕺","homme dansant",null,1122,"1F968","🥨","bretzel"]
[151,"26EA","⛪","église",null,475,"1F421","🐡","Blowfish",null,799,"1F587","🖇","trombones liés",null,1123,"1F969","🥩","coupe de viande"]
[152,"26F0","⛰","montagne",null,476,"1F422","🐢","tortue",null,800,"1F58A","🖊","stylo",null,1124,"1F96A","🥪","sandwich"]
[153,"26F1","⛱","parapluie au sol",null,477,"1F423","🐣","poussin à couver",null,801,"1F58B","🖋","stylo",null,1125,"1F96B","🥫","conserve"]
[154,"26F2","⛲","fontaine",null,478,"1F424","🐤","bébé poussin",null,802,"1F58C","🖌","pinceau",null,1126,"1F96C","🥬","vert feuillu"]
[155,"26F3","⛳","drapeau dans le trou",null,479,"1F425","🐥","poussin face à l’avant",null,803,"1F58D","🖍","crayon",null,1127,"1F96D","🥭","mangue"]
[156,"26F4","⛴","bac",null,480,"1F426","🐦","oiseau",null,804,"1F590","🖐","main avec les doigts écartés",null,1128,"1F96E","🥮","gâteau de lune"]
[157,"26F5","⛵","voilier",null,481,"1F427","🐧","pingouin",null,805,"1F595","🖕","majeur",null,1129,"1F96F","🥯","bagel"]
[158,"26F7","⛷","skieur",null,482,"1F428","🐨","koala",null,806,"1F596","🖖","santé vulcaine",null,1130,"1F970","🥰","visage souriant avec des cœurs"]
[159,"26F8","⛸","patin à glace",null,483,"1F429","🐩","caniche",null,807,"1F5A4","🖤","cœur noir",null,1131,"1F971","🥱","visage bâillant"]
[160,"26F9","⛹"," rebondissant balle",null,484,"1F42A","🐪","chameau",null,808,"1F5A5","🖥","ordinateur de bureau",null,1132,"1F972","🥲","visage souriant avec des larmes"]
[161,"26FA","⛺","tente",null,485,"1F42B","🐫","chameau à deux bosses",null,809,"1F5A8","🖨","imprimante",null,1133,"1F973","🥳","visage de fête"]
[162,"26FD","⛽","pompe à carburant",null,486,"1F42C","🐬","dauphin",null,810,"1F5B1","🖱","souris",null,1134,"1F974","🥴","visage woozy"]
[163,"2B50","⭐","étoile",null,487,"1F42D","🐭","visage de la souris",null,811,"1F5B2","🖲","trackball",null,1135,"1F975","🥵","visage chaud"]
[164,"2B55","⭕","cercle rouge creux",null,488,"1F42E","🐮","visage de vache",null,812,"1F5BC","🖼","image encadrée",null,1136,"1F976","🥶","visage froid"]
[165,30,"0","keycap: 0",null,489,"1F42F","🐯","visage de tigre",null,813,"1F5C2","🗂","diviseurs d’index de carte",null,1137,"1F977","🥷","Ninja"]
[166,2139,"ℹ","information",null,490,"1F430","🐰","visage de lapin",null,814,"1F5C3","🗃","boîte de fichier de carte",null,1138,"1F978","🥸","visage déguisé"]
[167,"24C2","Ⓜ","encerclé M",null,491,"1F431","🐱","cat faire",null,815,"1F5C4","🗄","classeur",null,1139,"1F979","🥹"]
[168,2122,"™","marque",null,492,"1F432","🐲","visage de dragon",null,816,"1F5D1","🗑","Corbeille",null,1140,"1F97A","🥺","plaider la face"]
[169,"1F004","🀄","mahjong dragon rouge",null,493,"1F433","🐳","baleine jaillissante",null,817,"1F5D2","🗒","bloc-notes en spirale",null,1141,"1F97B","🥻","sari"]
[170,"1F0CF","🃏","joker",null,494,"1F434","🐴","visage de cheval",null,818,"1F5D3","🗓","calendrier en spirale",null,1142,"1F97C","🥼","Blouse"]
[171,"1F170","🅰","Un bouton (groupe sanguin)",null,495,"1F435","🐵","visage de singe",null,819,"1F5DC","🗜","attache",null,1143,"1F97D","🥽","lunettes de protection"]
[172,"1F171","🅱","Bouton B (groupe sanguin)",null,496,"1F436","🐶","visage de chien",null,820,"1F5DD","🗝","ancienne clé",null,1144,"1F97E","🥾","chaussure de randonnée"]
[173,"1F17E","🅾","Bouton O (groupe sanguin)",null,497,"1F437","🐷","visage de porc",null,821,"1F5DE","🗞","journal enroulé",null,1145,"1F97F","🥿","chaussure plate"]
[174,"1F17F","🅿","Bouton P",null,498,"1F438","🐸","grenouille",null,822,"1F5E1","🗡","dague",null,1146,"1F980","🦀","crabe"]
[175,"1F18E","🆎","Bouton AB (groupe sanguin)",null,499,"1F439","🐹","hamster",null,823,"1F5E3","🗣","tête parlante",null,1147,"1F981","🦁","lion"]
[176,"1F191","🆑","Bouton CL",null,500,"1F43A","🐺","loup",null,824,"1F5E8","🗨","bulle de parole gauche",null,1148,"1F982","🦂","scorpion"]
[177,"1F192","🆒","Bouton COOL",null,501,"1F43B","🐻","ours",null,825,"1F5EF","🗯","bulle de colère droite",null,1149,"1F983","🦃","Turquie"]
[178,"1F193","🆓","Bouton GRATUIT",null,502,"1F43C","🐼","panda",null,826,"1F5F3","🗳","urne avec bulletin de vote",null,1150,"1F984","🦄","licorne"]
[179,"1F194","🆔","Bouton ID",null,503,"1F43D","🐽","nez de porc",null,827,"1F5FA","🗺","carte du monde",null,1151,"1F985","🦅","aigle"]
[180,"1F195","🆕","Bouton NOUVEAU",null,504,"1F43E","🐾","empreintes de pattes",null,828,"1F5FB","🗻","Mont Fuji",null,1152,"1F986","🦆","canard"]
[181,"1F196","🆖","Bouton NG",null,505,"1F43F","🐿","tamia",null,829,"1F5FC","🗼","Tour de Tokyo",null,1153,"1F987","🦇","bat"]
[182,"1F197","🆗","Bouton OK",null,506,"1F440","👀","yeux",null,830,"1F5FD","🗽","Statue de la Liberté",null,1154,"1F988","🦈","requin"]
[183,"1F198","🆘","Bouton SOS",null,507,"1F441","👁","oeil",null,831,"1F5FE","🗾","carte du Japon",null,1155,"1F989","🦉","hibou"]
[184,"1F199","🆙","EN HAUT! bouton",null,508,"1F442","👂","oreille",null,832,"1F5FF","🗿","moai",null,1156,"1F98A","🦊","Renard"]
[185,"1F19A","🆚","Bouton VS",null,509,"1F443","👃","nez",null,833,"1F600","😀","??",null,1157,"1F98B","🦋","papillon"]
[186,"1F201","🈁","Bouton japonais « ici »",null,510,"1F444","👄","bouche",null,834,"1F600","😀","Visage souriant",null,1158,"1F98C","🦌","cerf"]
[187,"1F202","🈂","Bouton japonais « frais de service »",null,511,"1F445","👅","langue",null,835,"1F601","😁","visage rayonnant avec des yeux souriants",null,1159,"1F98D","🦍","gorille"]
[188,"1F21A","🈚","Bouton japonais « gratuit »",null,512,"1F446","👆","index de revers pointant vers le haut",null,836,"1F602","😂","visage avec des larmes de joie",null,1160,"1F98E","🦎","lézard"]
[189,"1F22F","🈯","Bouton japonais « réservé »",null,513,"1F447","👇","index de revers pointant vers le bas",null,837,"1F603","😃",null,null,1161,"1F98F","🦏","rhinocéros"]
[190,"1F232","🈲","Bouton japonais « interdit »",null,514,"1F448","👈","index de revers pointant vers la gauche",null,838,"1F603","😃","Visage souriant avec de grands yeux",null,1162,"1F990","🦐","crevette"]
[191,"1F233","🈳","Bouton japonais « vacance »",null,515,"1F449","👉","index de revers pointant vers la droite",null,839,"1F604","😄","Visage souriant avec des yeux souriants",null,1163,"1F991","🦑","calmar"]
[192,"1F234","🈴","Bouton japonais « passing grade »",null,516,"1F44A","👊","poing venant en avant",null,840,"1F605","😅","Visage souriant avec de la sueur",null,1164,"1F992","🦒","girafe"]
[193,"1F235","🈵","Bouton japonais « no vacancy »",null,517,"1F44B","👋","agitant la main",null,841,"1F606","😆","Sourire en plissant les ébissements",null,1165,"1F993","🦓","zèbre"]
[194,"1F236","🈶","Bouton japonais « non gratuit »",null,518,"1F44C","👌","OK main",null,842,"1F607","😇","visage souriant avec halo",null,1166,"1F994","🦔","hérisson"]
[195,"1F237","🈷","Bouton japonais « montant mensuel »",null,519,"1F44D","👍","Feu vert",null,843,"1F608","😈","visage souriant avec des cornes",null,1167,"1F995","🦕","sauropode"]
[196,"1F238","🈸","Bouton « application » japonais",null,520,"1F44E","👎","pouce vers le bas",null,844,"1F609","😉","clin d’œil au visage",null,1168,"1F996","🦖","T-Rex"]
[197,"1F239","🈹","Bouton japonais « discount »",null,521,"1F44F","👏","tapant des mains",null,845,"1F60A","😊","visage souriant avec des yeux souriants",null,1169,"1F997","🦗","grillon"]
[198,"1F23A","🈺","Bouton japonais « open for business »",null,522,"1F450","👐","ouvrir les mains",null,846,"1F60B","😋","visage savourant de la nourriture",null,1170,"1F998","🦘","kangourou"]
[199,"1F250","🉐","Bouton japonais « bargain »",null,523,"1F451","👑","couronne",null,847,"1F60C","😌","visage soulagé",null,1171,"1F999","🦙","flamme"]
[200,"1F251","🉑","Bouton japonais « acceptable »",null,524,"1F452","👒","chapeau de femme",null,848,"1F60D","😍","visage souriant avec des yeux de cœur",null,1172,"1F99A","🦚","paon"]
[201,"1F300","🌀","cyclone",null,525,"1F453","👓","lunettes",null,849,"1F60E","😎","visage souriant avec des lunettes de soleil",null,1173,"1F99B","🦛","hippopotame"]
[202,"1F301","🌁","brumeux",null,526,"1F454","👔","cravate",null,850,"1F60F","😏","visage souriant",null,1174,"1F99C","🦜","perroquet"]
[203,"1F302","🌂","parapluie fermé",null,527,"1F455","👕","t-shirt",null,851,"1F610","😐","visage neutre",null,1175,"1F99D","🦝","raton laveur"]
[204,"1F303","🌃","nuit avec des étoiles",null,528,"1F456","👖","jeans",null,852,"1F611","😑","visage sans expression",null,1176,"1F99E","🦞","homard"]
[205,"1F304","🌄","lever de soleil sur les montagnes",null,529,"1F457","👗","robe",null,853,"1F612","😒","visage non amusé",null,1177,"1F99F","🦟","moustique"]
[206,"1F305","🌅","lever du soleil",null,530,"1F458","👘","kimono",null,854,"1F613","😓","visage abattu avec de la sueur",null,1178,"1F9A0","🦠","microbe"]
[207,"1F306","🌆","paysage urbain au crépuscule",null,531,"1F459","👙","bikini",null,855,"1F614","😔","visage pensif",null,1179,"1F9A1","🦡","blaireau"]
[208,"1F307","🌇","coucher de soleil",null,532,"1F45A","👚","vêtements de femme",null,856,"1F615","😕","visage confus",null,1180,"1F9A2","🦢","cygne"]
[209,"1F308","🌈","arc-en-ciel",null,533,"1F45B","👛","porte-monnaie",null,857,"1F616","😖","visage confus",null,1181,"1F9A3","🦣","mammouth"]
[210,"1F309","🌉","pont la nuit",null,534,"1F45C","👜","sac à main",null,858,"1F617","😗","embrasser le visage",null,1182,"1F9A4","🦤","dodo"]
[211,"1F30A","🌊","vague d’eau",null,535,"1F45D","👝","sac d’embrayage",null,859,"1F618","😘","visage soufflant un baiser",null,1183,"1F9A5","🦥","paresse"]
[212,"1F30B","🌋","volcan",null,536,"1F45E","👞","chaussure d’homme",null,860,"1F619","😙","embrasser le visage avec des yeux souriants",null,1184,"1F9A6","🦦","loutre"]
[213,"1F30C","🌌","Voie Lactée",null,537,"1F45F","👟","chaussure de course",null,861,"1F61A","😚","embrasser le visage les yeux fermés",null,1185,"1F9A7","🦧","orang-outan"]
[214,"1F30D","🌍","globe montrant l’Europe-Afrique",null,538,"1F460","👠","chaussure à talons hauts",null,862,"1F61B","😛","visage avec langue",null,1186,"1F9A8","🦨","mouffette"]
[215,"1F30E","🌎","globe montrant les Amériques",null,539,"1F461","👡","sandale femme",null,863,"1F61C","😜","clin d’œil au visage avec la langue",null,1187,"1F9A9","🦩","Flamant"]
[216,"1F30F","🌏","globe montrant l’Asie-Australie",null,540,"1F462","👢","botte de femme",null,864,"1F61D","😝","plisser les quins avec la langue",null,1188,"1F9AA","🦪","huître"]
[217,"1F310","🌐","globe avec méridiens",null,541,"1F463","👣","Empreintes",null,865,"1F61E","😞","visage déçu",null,1189,"1F9AB","🦫","castor"]
[218,"1F311","🌑","nouvelle lune",null,542,"1F464","👤","buste en silhouette",null,866,"1F61F","😟","visage inquiet",null,1190,"1F9AC","🦬","bison"]
[219,"1F312","🌒","croissant de lune",null,543,"1F465","👥","bustes en silhouette",null,867,"1F620","😠","visage en colère",null,1191,"1F9AD","🦭","Phoque"]
[220,"1F313","🌓","premier quartier de lune",null,544,"1F466","👦","garçon",null,868,"1F621","😡","faire la moue du visage",null,1192,"1F9AE","🦮","chien-guide"]
[221,"1F314","🌔","cire de lune gibbeuse",null,545,"1F467","👧","fille",null,869,"1F622","😢","visage qui pleure",null,1193,"1F9AF","🦯","cane blanche"]
[222,"1F315","🌕","pleine lune",null,546,"1F468","👨","Un",null,870,"1F623","😣","visage persévérant",null,1194,"1F9B0","🦰","cheveux roux"]
[223,"1F316","🌖","lune gibbeuse décroissante",null,547,"1F469","👩","femme",null,871,"1F624","😤","visage avec la vapeur du nez",null,1195,"1F9B1","🦱","cheveux bouclés"]
[224,"1F317","🌗","dernier quartier de lune",null,548,"1F46A","👪","Famille",null,872,"1F625","😥","visage triste mais soulagé",null,1196,"1F9B2","🦲","bientôt"]
[225,"1F318","🌘","croissant de lune décroissant",null,549,"1F46B","👫","femme et homme se tenant la main",null,873,"1F626","😦","visage fronçant les sourcils avec la bouche ouverte",null,1197,"1F9B3","🦳","cheveux blancs"]
[226,"1F319","🌙","croissant",null,550,"1F46C","👬","hommes se tenant la main",null,874,"1F627","😧","visage angoissé",null,1198,"1F9B4","🦴","os"]
[227,"1F31A","🌚","nouvelle face à la lune",null,551,"1F46D","👭","les femmes se tenant la main",null,875,"1F628","😨","visage craintif",null,1199,"1F9B5","🦵","jambe"]
[228,"1F31B","🌛","premier quartier de lune face",null,552,"1F46E","👮","policier",null,876,"1F629","😩","visage fatigué",null,1200,"1F9B6","🦶","pied"]
[229,"1F31C","🌜","dernier visage de quart de lune",null,553,"1F46F","👯","les personnes ayant des oreilles de lapin",null,877,"1F62A","😪","visage endormi",null,1201,"1F9B7","🦷","dent"]
[230,"1F31D","🌝","visage de pleine lune",null,554,"1F470","👰","personne avec voile",null,878,"1F62B","😫","visage fatigué",null,1202,"1F9B8","🦸","super-héros"]
[231,"1F31E","🌞","soleil avec visage",null,555,"1F471","👱","personne: cheveux blonds",null,879,"1F62C","😬","grimaçant le visage",null,1203,"1F9B9","🦹","super-vilain"]
[232,"1F31F","🌟","étoile brillante",null,556,"1F472","👲","personne avec calotte",null,880,"1F62D","😭","visage qui pleure fort",null,1204,"1F9BA","🦺","gilet de sécurité"]
[233,"1F320","🌠","étoile filante",null,557,"1F473","👳","personne portant un turban",null,881,"1F62E","😮","visage avec la bouche ouverte",null,1205,"1F9BB","🦻","oreille avec aide auditive"]
[234,"1F321","🌡","thermomètre",null,558,"1F474","👴","vieillard",null,882,"1F62F","😯","visage feutré",null,1206,"1F9BC","🦼","fauteuil roulant motorisé"]
[235,"1F324","🌤","soleil derrière un petit nuage",null,559,"1F475","👵","vieille femme",null,883,"1F630","😰","visage anxieux avec de la sueur",null,1207,"1F9BD","🦽","fauteuil roulant manuel"]
[236,"1F325","🌥","soleil derrière un gros nuage",null,560,"1F476","👶","bébé",null,884,"1F631","😱","visage hurlant de peur",null,1208,"1F9BE","🦾","bras mécanique"]
[237,"1F326","🌦","soleil derrière le nuage de pluie",null,561,"1F477","👷","ouvrier du bâtiment",null,885,"1F632","😲","visage étonné",null,1209,"1F9BF","🦿","jambe mécanique"]
[238,"1F327","🌧","nuage avec pluie",null,562,"1F478","👸","princesse",null,886,"1F633","😳","visage rougi",null,1210,"1F9C0","🧀","coin de fromage"]
[239,"1F328","🌨","nuage avec neige",null,563,"1F479","👹","ogre",null,887,"1F634","😴","visage endormi",null,1211,"1F9C1","🧁","Cupcake"]
[240,"1F329","🌩","nuage avec la foudre",null,564,"1F47A","👺","lutin",null,888,"1F635","😵","visage avec des yeux barrés",null,1212,"1F9C2","🧂","sel"]
[241,"1F32A","🌪","tornade",null,565,"1F47B","👻","fantôme",null,889,"1F636","😶","visage sans bouche",null,1213,"1F9C3","🧃","boîte à boissons"]
[242,"1F32B","🌫","dent",null,566,"1F47C","👼","bébé ange",null,890,"1F637","😷"," avec masque médical",null,1214,"1F9C4","🧄","ail"]
[243,"1F32C","🌬","face au vent",null,567,"1F47D","👽","étranger",null,891,"1F638","😸","chat souriant avec des yeux souriants",null,1215,"1F9C5","🧅","oignon"]
[244,"1F32D","🌭","hot-dog",null,568,"1F47E","👾","monstre extraterrestre",null,892,"1F639","😹","chat avec des larmes de joie",null,1216,"1F9C6","🧆","falafel"]
[245,"1F32E","🌮","taco",null,569,"1F47F","👿","visage en colère avec des cornes",null,893,"1F63A","😺","Chat souriant",null,1217,"1F9C7","🧇","gaufre"]
[246,"1F32F","🌯","burrito",null,570,"1F480","💀","crâne",null,894,"1F63B","😻","chat souriant avec des yeux de cœur",null,1218,"1F9C8","🧈","beurre"]
[247,"1F330","🌰","châtaigne",null,571,"1F481","💁","personne basculant la main",null,895,"1F63C","😼","chat au sourire ironique",null,1219,"1F9C9","🧉","compagnon"]
[248,"1F331","🌱","plant",null,572,"1F482","💂","garde",null,896,"1F63D","😽","embrasser le chat",null,1220,"1F9CA","🧊","glace"]
[249,"1F332","🌲","arbre à feuilles persistantes",null,573,"1F483","💃","femme dansant",null,897,"1F63E","😾","faire la moue",null,1221,"1F9CB","🧋","thé à bulles"]
[250,"1F333","🌳","arbre feuillu",null,574,"1F484","💄","rouge à lèvres",null,898,"1F63F","😿","chat qui pleure",null,1222,"1F9CC","🧌"]
[251,"1F334","🌴","palmier",null,575,"1F485","💅","vernis à ongles",null,899,"1F640","🙀","chat fatigué",null,1223,"1F9CD","🧍","personne debout"]
[252,"1F335","🌵","cactus",null,576,"1F486","💆","personne se faisant masser",null,900,"1F641","🙁","visage légèrement froncé les sourcils",null,1224,"1F9CE","🧎","personne agenouillé"]
[253,"1F336","🌶","piment",null,577,"1F487","💇","personne se faisant couper les cheveux",null,901,"1F642","🙂","visage légèrement souriant",null,1225,"1F9CF","🧏","sourd"]
[254,"1F337","🌷","Tulipe",null,578,"1F488","💈","bâton de barbier",null,902,"1F643","🙃","visage à l’envers",null,1226,"1F9D0","🧐","visage avec monocle"]
[255,"1F338","🌸","fleur de cerisier",null,579,"1F489","💉","seringue",null,903,"1F644","🙄","visage avec des yeux qui roulent",null,1227,"1F9D1","🧑","personne"]
[256,"1F339","🌹","rose",null,580,"1F48A","💊","pilule",null,904,"1F645","🙅","personne faisant signe NON",null,1228,"1F9D2","🧒","enfant"]
[257,"1F33A","🌺","hibiscus",null,581,"1F48B","💋","marque de baiser",null,905,"1F646","🙆","personne faisant signe OK",null,1229,"1F9D3","🧓","personne âgée"]
[258,"1F33B","🌻","tournesol",null,582,"1F48C","💌","lettre d’amour",null,906,"1F647","🙇","personne s’inclinant",null,1230,"1F9D4","🧔","personne: barbe"]
[259,"1F33C","🌼","fleurir",null,583,"1F48D","💍","bague",null,907,"1F648","🙈","voir-pas-mal singe",null,1231,"1F9D5","🧕","femme avec foulard"]
[260,"1F33D","🌽","épi de maïs",null,584,"1F48E","💎","pierre précieuse",null,908,"1F649","🙉","n’entendez pas de singe maléfique",null,1232,"1F9D6","🧖","personne dans une chambre à vapeur"]
[261,"1F33E","🌾","gerbe de riz",null,585,"1F48F","💏","baiser",null,909,"1F64A","🙊","parler-pas-mal singe",null,1233,"1F9D7","🧗","personne grimpant"]
[262,"1F33F","🌿","herbe",null,586,"1F490","💐","bouquet",null,910,"1F64B","🙋","personne levant la main",null,1234,"1F9D8","🧘","personne en position lotus"]
[263,"1F340","🍀","trèfle à quatre feuilles",null,587,"1F491","💑","couple avec cœur",null,911,"1F64C","🙌","lever la main",null,1235,"1F9D9","🧙","mage"]
[264,"1F341","🍁","feuille d’érable",null,588,"1F492","💒","mariage",null,912,"1F64D","🙍","personne fronçant les sourcils",null,1236,"1F9DA","🧚","fée"]
[265,"1F342","🍂","feuille tombée",null,589,"1F493","💓","cœur battant",null,913,"1F64E","🙎","personne mettant la moue",null,1237,"1F9DB","🧛","vampire"]
[266,"1F343","🍃","feuilles flottant dans le vent",null,590,"1F494","💔","cœur brisé",null,914,"1F64F","🙏","mains jointes",null,1238,"1F9DC","🧜","merperson"]
[267,"1F344","🍄","champignon",null,591,"1F495","💕","deux cœurs",null,915,"1F680","🚀","fusée",null,1239,"1F9DD","🧝","Onze"]
[268,"1F345","🍅","tomate",null,592,"1F496","💖","cœur étincelant",null,916,"1F681","🚁","hélicoptère",null,1240,"1F9DE","🧞","génie"]
[269,"1F346","🍆","aubergine",null,593,"1F497","💗","cœur en croissance",null,917,"1F682","🚂","locomotive",null,1241,"1F9DF","🧟","zombi"]
[270,"1F347","🍇","raisins",null,594,"1F498","💘","cœur avec flèche",null,918,"1F683","🚃","wagon de chemin de fer",null,1242,"1F9E0","🧠","cerveau"]
[271,"1F348","🍈","melon",null,595,"1F499","💙","cœur bleu",null,919,"1F684","🚄","TGV",null,1243,"1F9E1","🧡","cœur orange"]
[272,"1F349","🍉","pastèque",null,596,"1F49A","💚","cœur vert",null,920,"1F685","🚅","shinkansen",null,1244,"1F9E2","🧢","bouchon facturé"]
[273,"1F34A","🍊","mandarine",null,597,"1F49B","💛","cœur jaune",null,921,"1F686","🚆","train",null,1245,"1F9E3","🧣","foulard"]
[274,"1F34B","🍋","citron",null,598,"1F49C","💜","cœur violet",null,922,"1F687","🚇","métro",null,1246,"1F9E4","🧤","Gants"]
[275,"1F34C","🍌","banane",null,599,"1F49D","💝","cœur avec ruban",null,923,"1F688","🚈","train léger sur rail",null,1247,"1F9E5","🧥","manteau"]
[276,"1F34D","🍍","ananas",null,600,"1F49E","💞","cœurs tournants",null,924,"1F689","🚉","gare",null,1248,"1F9E6","🧦","chaussettes"]
[277,"1F34E","🍎","pomme rouge",null,601,"1F49F","💟","décoration de cœur",null,925,"1F68A","🚊","tramway",null,1249,"1F9E7","🧧","enveloppe rouge"]
[278,"1F34F","🍏","pomme verte",null,602,"1F4A0","💠","diamant avec un point",null,926,"1F68B","🚋","voiture de tramway",null,1250,"1F9E8","🧨","pétard"]
[279,"1F350","🍐","poire",null,603,"1F4A1","💡","ampoule",null,927,"1F68C","🚌","bus",null,1251,"1F9E9","🧩","Puzzle"]
[280,"1F351","🍑","pêche",null,604,"1F4A2","💢","symbole de colère",null,928,"1F68D","🚍","bus venant en venant en venant en couple",null,1252,"1F9EA","🧪","éprouvette"]
[281,"1F352","🍒","Cerises",null,605,"1F4A3","💣","bombe",null,929,"1F68E","🚎","trolleybus",null,1253,"1F9EB","🧫","Pétri"]
[282,"1F353","🍓","fraise",null,606,"1F4A4","💤","zzz",null,930,"1F68F","🚏","arrêt de bus",null,1254,"1F9EC","🧬","ADN"]
[283,"1F354","🍔","hamburger",null,607,"1F4A5","💥","collision",null,931,"1F690","🚐","minibus",null,1255,"1F9ED","🧭","boussole"]
[284,"1F355","🍕","pizza",null,608,"1F4A6","💦","gouttelettes de sueur",null,932,"1F691","🚑","ambulance",null,1256,"1F9EE","🧮","abaque"]
[285,"1F356","🍖","viande sur os",null,609,"1F4A7","💧","gouttelette",null,933,"1F692","🚒","voiture de pompiers",null,1257,"1F9EF","🧯","extincteur"]
[286,"1F357","🍗","cuisse de volaille",null,610,"1F4A8","💨","s’enfuir",null,934,"1F693","🚓","véhicule de police",null,1258,"1F9F0","🧰","toolbox"]
[287,"1F358","🍘","craquelin de riz",null,611,"1F4A9","💩","tas de caca",null,935,"1F694","🚔","voiture de police venant en voiture venant en voiture",null,1259,"1F9F1","🧱","brique"]
[288,"1F359","🍙","boule de riz",null,612,"1F4AA","💪","biceps fléchis",null,936,"1F695","🚕","taxi",null,1260,"1F9F2","🧲","aimant"]
[289,"1F35A","🍚","riz cuit",null,613,"1F4AB","💫","vertigineux",null,937,"1F696","🚖","taxi venant en venant en voiture",null,1261,"1F9F3","🧳","bagage"]
[290,"1F35B","🍛","riz au curry",null,614,"1F4AC","💬","ballon vocal",null,938,"1F697","🚗","automobile",null,1262,"1F9F4","🧴","flacon de lotion"]
[291,"1F35C","🍜","bol fumant",null,615,"1F4AD","💭","ballon de pensée",null,939,"1F698","🚘","automobile venant en venant en voiture",null,1263,"1F9F5","🧵","fil"]
[292,"1F35D","🍝","spaghettis",null,616,"1F4AE","💮","fleur blanche",null,940,"1F699","🚙","véhicule utilitaire sport",null,1264,"1F9F6","🧶","fil"]
[293,"1F35E","🍞","pain",null,617,"1F4AF","💯","cent points",null,941,"1F69A","🚚","camion de livraison",null,1265,"1F9F7","🧷","épingle de sûreté"]
[294,"1F35F","🍟","frites",null,618,"1F4B0","💰","sac d’argent",null,942,"1F69B","🚛","camion articulé",null,1266,"1F9F8","🧸","nounours"]
[295,"1F360","🍠","patate douce rôtie",null,619,"1F4B1","💱","Change",null,943,"1F69C","🚜","tracteur",null,1267,"1F9F9","🧹","balai"]
[296,"1F361","🍡","dango",null,620,"1F4B2","💲","signe dollar lourd",null,944,"1F69D","🚝","monorail",null,1268,"1F9FA","🧺","panier"]
[297,"1F362","🍢","Oden",null,621,"1F4B3","💳","carte de crédit",null,945,"1F69E","🚞","chemin de fer de montagne",null,1269,"1F9FB","🧻","rouleau de papier"]
[298,"1F363","🍣","sushi",null,622,"1F4B4","💴","Billet de banque en yen",null,946,"1F69F","🚟","chemin de fer suspendu",null,1270,"1F9FC","🧼","savon"]
[299,"1F364","🍤","crevettes frites",null,623,"1F4B5","💵","billet de banque en dollars",null,947,"1F6A0","🚠","téléphérique de montagne",null,1271,"1F9FD","🧽","éponge"]
[300,"1F365","🍥","gâteau de poisson avec tourbillon",null,624,"1F4B6","💶","billet en euros",null,948,"1F6A1","🚡","téléphérique",null,1272,"1F9FE","🧾","reçu"]
[301,"1F366","🍦","crème glacée molle",null,625,"1F4B7","💷","Billet de banque en livres sterling",null,949,"1F6A2","🚢","bateau",null,1273,"1F9FF","🧿","amulette nazar"]
[302,"1F367","🍧","glace rasée",null,626,"1F4B8","💸","de l’argent avec des ailes",null,950,"1F6A3","🚣","personne bateau à rames",null,1274,"1FA70","🩰","chaussures de ballet"]
[303,"1F368","🍨","glace",null,627,"1F4B9","💹","graphique en hausse avec le yen",null,951,"1F6A4","🚤","vedette",null,1275,"1FA71","🩱","maillot de bain une pièce"]
[304,"1F369","🍩","beignet",null,628,"1F4BA","💺","siège",null,952,"1F6A5","🚥","feu de circulation horizontal",null,1276,"1FA72","🩲","cache-sexes"]
[305,"1F36A","🍪","biscuit",null,629,"1F4BB","💻","ordinateur portable",null,953,"1F6A6","🚦","feu de circulation vertical",null,1277,"1FA73","🩳","short"]
[306,"1F36B","🍫","barre chocolatée",null,630,"1F4BC","💼","porte-documents",null,954,"1F6A7","🚧","construction",null,1278,"1FA74","🩴","sandale string"]
[307,"1F36C","🍬","bonbon",null,631,"1F4BD","💽","disque d’ordinateur",null,955,"1F6A8","🚨","feu de voiture de police",null,1279,"1FA78","🩸"," de sang"]
[308,"1F36D","🍭","sucette",null,632,"1F4BE","💾","disquette",null,956,"1F6A9","🚩","drapeau triangulaire",null,1280,"1FA79","🩹","sparadrap"]
[309,"1F36E","🍮","crème",null,633,"1F4BF","💿","disque optique",null,957,"1F6AA","🚪","par",null,1281,"1FA7A","🩺","stéthoscope"]
[310,"1F36F","🍯","pot de miel",null,634,"1F4C0","📀","DVD",null,958,"1F6AB","🚫","interdit",null,1282,"1FA7B","🩻"]
[311,"1F370","🍰","shortcake",null,635,"1F4C1","📁","dossier de fichiers",null,959,"1F6AC","🚬","cigarette",null,1283,"1FA7C","🩼"]
[312,"1F371","🍱","boîte bento",null,636,"1F4C2","📂","ouvrir le dossier de fichiers",null,960,"1F6AD","🚭","défense de fumer",null,1284,"1FA80","🪀","ils-sont"]
[313,"1F372","🍲","pot de nourriture",null,637,"1F4C3","📃","page avec boucle",null,961,"1F6AE","🚮","litière dans le panneau de bac",null,1285,"1FA81","🪁","cerf-volant"]
[314,"1F373","🍳","cuisine",null,638,"1F4C4","📄","page tournée vers le haut",null,962,"1F6AF","🚯","pas de détritus",null,1286,"1FA82","🪂","parachute"]
[315,"1F374","🍴","fourchette et couteau",null,639,"1F4C5","📅","calendrier",null,963,"1F6B0","🚰","eau potable",null,1287,"1FA83","🪃","boomerang"]
[316,"1F375","🍵","tasse à thé sans poignée",null,640,"1F4C6","📆","calendrier dérachant",null,964,"1F6B1","🚱","eau non potable",null,1288,"1FA84","🪄","mur magique"]
[317,"1F376","🍶","saké",null,641,"1F4C7","📇","index des cartes",null,965,"1F6B2","🚲","bicyclette",null,1289,"1FA85","🪅","piñata"]
[318,"1F377","🍷","verre à vin",null,642,"1F4C8","📈","graphique croissant",null,966,"1F6B3","🚳","pas de vélos",null,1290,"1FA86","🪆","poupées gigognes"]
[319,"1F378","🍸","verre à cocktail",null,643,"1F4C9","📉","graphique décroissant",null,967,"1F6B4","🚴","personne à vélo",null,1291,"1FA90","🪐","planète anneée"]
[320,"1F379","🍹","boisson tropicale",null,644,"1F4CA","📊","graphique à barres",null,968,"1F6B5","🚵","personne VTT",null,1292,"1FA91","🪑","chaise"]
[321,"1F37A","🍺","tasse à bière",null,645,"1F4CB","📋","Presse-papiers",null,969,"1F6B6","🚶","personne qui marche",null,1293,"1FA92","🪒","rasoir"]
[322,"1F37B","🍻","tasses à bière qui clignotent",null,646,"1F4CC","📌","punaise",null,970,"1F6B7","🚷","pas de piétons",null,1294,"1FA93","🪓","axe"]
[323,"1F37C","🍼","biberon",null,647,"1F4CD","📍","poussoir rond",null,971,"1F6B8","🚸","enfants traversant",null,1295,"1FA94","🪔","lampe diya"]
[324,"1F37D","🍽","fourchette et couteau avec assiette",null,648,"1F4CE","📎","trombone",null,972,"1F6B9","🚹","chambre homme",null,1296,"1FA95","🪕","banjo"]

{"sheet":"Polices de Symboles","index":14,"n_rows":172,"n_cols":91,"rows_kept":172,"cut":false,"hidden":false,"merged":[[94,2,94,3],[94,5,94,6],[94,8,94,9],[94,11,94,12],[94,15,94,16],[136,2,136,3],[136,5,136,6],[136,8,136,9],[136,11,136,12],[136,15,136,16],[68,55,69,55],[69,32,69,46],[71,55,72,55],[136,24,136,25],[94,18,94,19],[94,21,94,22],[94,24,94,25],[136,18,136,19],[136,21,136,22],[55,55,56,55],[59,55,60,55],[62,30,63,46],[62,55,63,55],[65,30,67,42],[65,55,66,55],[43,55,44,55],[46,55,47,55],[49,55,50,55],[52,2,52,3],[52,5,52,6],[52,8,52,9],[52,11,52,12],[52,15,52,16],[52,18,52,19],[52,21,52,22],[52,24,52,25],[52,55,53,55],[39,55,40,55],[10,21,10,22],[10,24,10,25],[11,55,12,55],[14,55,15,55],[17,55,18,55],[20,55,21,55],[23,55,24,55],[27,55,28,55],[30,55,31,55],[33,55,34,55],[36,55,37,55],[10,18,10,19],[10,2,10,3],[10,5,10,6],[10,8,10,9],[10,11,10,12],[10,15,10,16]]}
[]
[null,null,null,null,null,null,null,null,null,null,null,null,null,null,null,null,null,null,null,null,"Mise à jour du 14 Décembre 2021"]
[null,null,null,null,null,null,null,null,null,null,null,null,null,null,null,null,null,null,null,null,"annule ou remplace les versions précédentes"]
[]
[]
[0,"COMMENT CHOISIR SA POLICE DE SYMBOLES  UPRM 1991. Servez vous du pinceau pour reproduire les symboles que vous souhaitez utiliser.Attention saisissez la bonne lettre ou le bon chiffre pour la reproduction"]
[null,{"$f":"CELL(\"nomfichier\")","v":"E:\\0-UPRT\\1-UPRT.FR-SITE-WEB\\re-recettes-jean-marc-catteau\\re-catteau-galettes\\[GA-pate.sud.finistere.xlsm]Modes.d'emploi"}]
[null,"Saisir lettre ou nombre",null,"Correspondance","Police Wingdins",null,null,null,null,null,null,null,null,null,"Saisir lettre ou nombre",null,"Correspondance","Police Wingdins 2 "]
[null,45,"=",{"$f":"B9","v":45},"Copiez / collez le symbole sur votre document ou faites un imprim'écran",null,null,null,null,null,null,null,null,null,"Aa","=",{"$f":"O9","v":"Aa"},"Copiez / collez le symbole sur votre document ou faites un imprim'écran"]
[null,null,null,null,null,null,null,null,null,null,null,null,null,null,null,null,null,null,null,null,null,null,null,null,null,null,null,null,null,"PREMIERE RANGÉE DU CLAVIER",null,null,null,null,null,null,null,null,null,null,null,null,null,null,null,null,null,null,null,null,null,null,null,null,null,null,"PREMIERE RANGÉE DU CLAVIER"]
[null,"Majuscules","correspondance",null,"Minuscules","correspondance",null,"Chiffres","correspondance",null,"nombres","correspondance",null,null,"Majuscules","correspondance",null,"Minuscules","correspondance",null,"Chiffres","correspondance",null,"nombres","correspondance"]
[null,"A","=","A","a","=","a",1,"=",1,27,"=",27,null,"A","=","A","a","=","a",1,"=",1,27,"=",27,null,null,null,"Raccourcis","Alt + 0169",null,"ALT + 0171",null,"ALT + 0172",null,"ALT + 0174",null,"ALT + 0177",null,"ALT + 0179",null,"ALT + 0182",null,"ALT + 0183",null,"ALT + 0185",null,"ALT + 0187",null,"ALT + 0188",null,"ALT + 0189",null,null,"Arial Narrow",1,null,null,2,null,null,3,null,null,4,null,null,5,null,null,6,null,null,7,null,null,8,null,null,9,null,null,0,null,null,"°",null,null,"+"]
[null,"B","=","B","b","=","b",2,"=",2,28,"=",28,null,"B","=","B","b","=","b",2,"=",2,28,"=",28,null,null,null,null,null,null,null,null,null,null,null,null,null,null,null,null,null,null,null,null,null,null,null,null,null,null,null,null,null,null,"&",null,null,"é","~",null,"\"","#",null,"' ","{",null,"(","[",null,"-","|",null,"è","`",null,"_","\\",null,"ç","^",null,"à","@",null,")","]",null,"=","}"]
[null,"C","=","C","c","=","c",3,"=",3,29,"=",29,null,"C","=","C","c","=","c",3,"=",3,29,"=",29,null,null,null,"Arial","©",null,"«",null,"¬",null,"®",null,"±",null,"³",null,"¶",null,"·",null,"¹",null,"»",null,"¼",null,"½"]
[null,"D","=","D","d","=","d",4,"=",4,30,"=",30,null,"D","=","D","d","=","d",4,"=",4,30,"=",30,null,null,null,null,null,null,null,null,null,null,null,null,null,null,null,null,null,null,null,null,null,null,null,null,null,null,null,null,null,"Webdings",1,null,null,2,null,null,3,null,null,4,null,null,5,null,null,6,null,null,7,null,null,8,null,null,9,null,null,0,null,null,"°",null,null,"+"]
[null,"E","=","E","e","=","e",5,"=",5,31,"=",31,null,"E","=","E","e","=","e",5,"=",5,31,"=",31,null,null,null,"Webdings","©",0,"«",0,"¬",0,"®",0,"±",0,"³",0,"¶",0,"·",0,"¹",0,"»",0,"¼",0,"½",null,null,null,"&",null,null,"é","~",null,"\"","#",null,"' ","{",null,"(","[",null,"-","|",null,"è","`",null,"_","\\",null,"ç","^",null,"à","@",null,")","]",null,"=","}"]
[null,"F","=","F","f","=","f",6,"=",6,32,"=",32,null,"F","=","F","f","=","f",6,"=",6,32,"=",32]
[null,"G","=","G","g","=","g",7,"=",7,33,"=",33,null,"G","=","G","g","=","g",7,"=",7,33,"=",33,null,null,null,"Windgins","©",0,"«",0,"¬",0,"®",0,"±",0,"³",0,"¶",0,"·",0,"¹",0,"»",0,"¼",0,"½",null,null,"Windgings",1,null,null,2,null,null,3,null,null,4,null,null,5,null,null,6,null,null,7,null,null,8,null,null,9,null,null,0,null,null,"°",null,null,"+"]
[null,"H","=","H","h","=","h",8,"=",8,34,"=",34,null,"H","=","H","h","=","h",8,"=",8,34,"=",34,null,null,null,null,null,null,null,null,null,null,null,null,null,null,null,null,null,null,null,null,null,null,null,null,null,null,null,null,null,null,"&",null,null,"é","~",null,"\"","#",null,"' ","{",null,"(","[",null,"-","|",null,"è","`",null,"_","\\",null,"ç","^",null,"à","@",null,")","]",null,"=","}"]
[null,"I","=","I","i","=","i",9,"=",9,35,"=",35,null,"I","=","I","i","=","i",9,"=",9,35,"=",35,null,null,null,"Windings 2","©",0,"«",0,"¬",0,"®",0,"±",0,"³",0,"¶",0,"·",0,"¹",0,"»",0,"¼",0,"½"]
[null,"J","=","J","j","=","j",10,"=",10,36,"=",36,null,"J","=","J","j","=","j",10,"=",10,36,"=",36,null,null,null,null,null,null,null,null,null,null,null,null,null,null,null,null,null,null,null,null,null,null,null,null,null,null,null,null,null,"Windgings 2",1,null,null,2,null,null,3,null,null,4,null,null,5,null,null,6,null,null,7,null,null,8,null,null,9,null,null,0,null,null,"°",null,null,"+"]
[null,"K","=","K","k","=","k",11,"=",11,37,"=",37,null,"K","=","K","k","=","k",11,"=",11,37,"=",37,null,null,null,"Windgings 3","©",0,"«",0,"¬",0,"®",0,"±",0,"³",0,"¶",0,"·",0,"¹",0,"»",0,"¼",0,"½",null,null,null,"&",null,null,"é","~",null,"\"","#",null,"' ","{",null,"(","[",null,"-","|",null,"è","`",null,"_","\\",null,"ç","^",null,"à","@",null,")","]",null,"=","}"]
[null,"L","=","L","l","=","l",12,"=",12,38,"=",38,null,"L","=","L","l","=","l",12,"=",12,38,"=",38]
[null,"M","=","M","m","=","m",13,"=",13,39,"=",39,null,"M","=","M","m","=","m",13,"=",13,39,"=",39,null,null,null,"ABSENT DU CLAVIER",null,null,null,null,null,null,null,null,null,null,null,null,null,null,null,null,null,null,null,null,null,null,null,null,null,"Windgings 3",1,null,null,2,null,null,3,null,null,4,null,null,5,null,null,6,null,null,7,null,null,8,null,null,9,null,null,0,null,null,"°",null,null,"+"]
[null,"N","=","N","n","=","n",14,"=",14,40,"=",40,null,"N","=","N","n","=","n",14,"=",14,40,"=",40,null,null,null,"Raccourcis","Alt + 0190",null,"Alt + 0191",null,"Alt + 0192",null,"Alt + 0194",null,"Alt + 0195",null,"Alt + 0196",null,"Alt + 0197",null,"Alt + 0198",null,"Alt + 0199",null,"Alt + 0200",null,"Alt + 0201",null,"Alt + 0202",null,null,null,"&",null,null,"é","~",null,"\"","#",null,"' ","{",null,"(","[",null,"-","|",null,"è","`",null,"_","\\",null,"ç","^",null,"à","@",null,")","]",null,"=","}"]
[null,"O","=","O","o","=","o",15,"=",15,41,"=",41,null,"O","=","O","o","=","o",15,"=",15,41,"=",41]
[null,"P","=","P","p","=","p",16,"=",16,42,"=",42,null,"P","=","P","p","=","p",16,"=",16,42,"=",42,null,null,null,"Arial","¾",null,"¿",null,"À",null,"Â",null,"Ã",null,"Ä",null,"Å",null,"Æ",null,"Ç",null,"È",null,"É",null,"Ê",null,null,null,"DEUXIÈME RANGÉE  DU CLAVIER"]
[null,"Q","=","Q","q","=","q",17,"=",17,43,"=",43,null,"Q","=","Q","q","=","q",17,"=",17,43,"=",43,null,null,null,null,null,null,null,null,null,null,null,null,null,null,null,null,null,null,null,null,null,null,null,null,null,null,null,null,null,"Arial Narrow","A",null,null,"Z",null,null,"E",null,null,"R",null,null,"T",null,null,"Y",null,null,"U",null,null,"I",null,null,"O",null,null,"P",null,null,"¨",null,null,"£"]
[null,"R","=","R","r","=","r",18,"=",18,44,"=",44,null,"R","=","R","r","=","r",18,"=",18,44,"=",44,null,null,null,"Webdings","¾",0,"¿",0,"À",0,"Â",0,"Ã",0,"Ä",0,"Å",0,"Æ",0,"Ç",0,"È",0,"É",0,"Ê",null,null,null,"a",null,null,"z",null,null,"e",null,null,"r",null,null,"t",null,null,"y",null,null,"u",null,null,"i",null,null,"o",null,null,"p",null,null,"^",null,null,null,"¤"]
[null,"S","=","S","s","=","s",19,"=",19,45,"=",45,null,"S","=","S","s","=","s",19,"=",19,45,"=",45]
[null,"T","=","T","t","=","t",20,"=",20,46,"=",46,null,"T","=","T","t","=","t",20,"=",20,46,"=",46,null,null,null,"Windgins","¾",0,"¿",0,"À",0,"Â",0,"Ã",0,"Ä",0,"Å",0,"Æ",0,"Ç",0,"È",0,"É",0,"Ê",null,null,"Webdings","A",null,null,"Z",null,null,"E",null,null,"R",null,null,"T",null,null,"Y",null,null,"U",null,null,"I",null,null,"O",null,null,"P",null,null,"¨",null,null,"£"]
[null,"U","=","U","u","=","u",21,"=",21,47,"=",47,null,"U","=","U","u","=","u",21,"=",21,47,"=",47,null,null,null,null,null,null,null,null,null,null,null,null,null,null,null,null,null,null,null,null,null,null,null,null,null,null,null,null,null,null,"a",null,null,"z",null,null,"e",null,null,"r",null,null,"t",null,null,"y",null,null,"u",null,null,"i",null,null,"o",null,null,"p",null,null,"^",null,null,null,"¤"]
[null,"V","=","V","v","=","v",22,"=",22,48,"=",48,null,"V","=","V","v","=","v",22,"=",22,48,"=",48,null,null,null,"Windings 2","¾",0,"¿",0,"À",0,"Â",0,"Ã",0,"Ä",0,"Å",0,"Æ",0,"Ç",0,"È",0,"É",0,"Ê"]
[null,"W","=","W","w","=","w",23,"=",23,49,"=",49,null,"W","=","W","w","=","w",23,"=",23,49,"=",49,null,null,null,null,null,null,null,null,null,null,null,null,null,null,null,null,null,null,null,null,null,null,null,null,null,null,null,null,null,"Windgings","A",null,null,"Z",null,null,"E",null,null,"R",null,null,"T",null,null,"Y",null,null,"U",null,null,"I",null,null,"O",null,null,"P",null,null,"¨",null,null,"£"]
[null,"X","=","X","x","=","x",24,"=",24,50,"=",50,null,"X","=","X","x","=","x",24,"=",24,50,"=",50,null,null,null,"Windgings 3","¾",0,"¿",0,"À",0,"Â",0,"Ã",0,"Ä",0,"Å",0,"Æ",0,"Ç",0,"È",0,"É",0,"Ê",null,null,null,"a",null,null,"z",null,null,"e",null,null,"r",null,null,"t",null,null,"y",null,null,"u",null,null,"i",null,null,"o",null,null,"p",null,null,"^",null,null,null,"¤"]
[null,"Y","=","Y","y","=","y",25,"=",25,51,"=",51,null,"Y","=","Y","y","=","y",25,"=",25,51,"=",51]
[null,"Z","=","Z","z","=","z",26,"=",26,52,"=",52,null,"Z","=","Z","z","=","z",26,"=",26,52,"=",52,null,null,null,"ABSENT DU CLAVIER",null,null,null,null,null,null,null,null,null,null,null,null,null,null,null,null,null,null,null,null,null,null,null,null,null,"Windgings 2","A",null,null,"Z",null,null,"E",null,null,"R",null,null,"T",null,null,"Y",null,null,"U",null,null,"I",null,null,"O",null,null,"P",null,null,"¨",null,null,"£"]
[null,"&","=","&","%","=","%","£","=","£",";","=",";",null,"&","=","&","%","=","%","£","=","£",";","=",";",null,null,null,"Raccourcis","Alt + 0203",null,"Alt + 0204",null,"Alt + 0205",null,"Alt + 0206",null,"Alt + 0207",null,"Alt + 0209",null,"Alt + 0212",null,"Alt + 0214",null,"Alt + 0215",null,"Alt + 0216",null,"Alt + 0217",null,"Alt + 0219",null,null,null,"a",null,null,"z",null,null,"e",null,null,"r",null,null,"t",null,null,"y",null,null,"u",null,null,"i",null,null,"o",null,null,"p",null,null,"^",null,null,null,"¤"]
[null,"é","=","é","#","=","#","@","=","@",":","=",":",null,"é","=","é","#","=","#","@","=","@",":","=",":"]
[null,"è","=","è","(","=","(","!","=","!","-","=","-",null,"è","=","è","(","=","(","!","=","!","-","=","-",null,null,null,"Arial","Ë",null,"Ì",null,"Í",null,"Î",null,"Ï",null,"Ñ",null,"Ô",null,"Ö",null,"×",null,"Ø",null,"Ù",null,"Û",null,null,"Windgings 3","A",null,null,"Z",null,null,"E",null,null,"R",null,null,"T",null,null,"Y",null,null,"U",null,null,"I",null,null,"O",null,null,"P",null,null,"¨",null,null,"£"]
[null,"ù","=","ù",")","=",")","?","=","?",".","=",".",null,"ù","=","ù",")","=",")","?","=","?",".","=",".",null,null,null,null,null,null,null,null,null,null,null,null,null,null,null,null,null,null,null,null,null,null,null,null,null,null,null,null,null,null,"a",null,null,"z",null,null,"e",null,null,"r",null,null,"t",null,null,"y",null,null,"u",null,null,"i",null,null,"o",null,null,"p",null,null,"^",null,null,null,"¤"]
[null,"ç","=","ç","[","=","[",">","=",">","~","=","~",null,"ç","=","ç","[","=","[",">","=",">","~","=","~",null,null,null,"Webdings","Ë",0,"Ì",0,"Í",0,"Î",0,"Ï",0,"Ñ",0,"Ô",0,"Ö",0,"×",0,"Ø",0,"Ù",0,"Û"]
[null,"à","=","à","]","=","]","<","=","<","\"","=","\"",null,"à","=","à","]","=","]","<","=","<","\"","=","\"",null,null,null,null,null,null,null,null,null,null,null,null,null,null,null,null,null,null,null,null,null,null,null,null,null,null,null,null,null,null,"TROISIÈME RANGÉE "]
[null,"µ","=","µ","{","=","{","\\","=","\\","*","=","*",null,"µ","=","µ","{","=","{","\\","=","\\","*","=","*",null,null,null,"Windgins","Ë",0,"Ì",0,"Í",0,"Î",0,"Ï",0,"Ñ",0,"Ô",0,"Ö",0,"×",0,"Ø",0,"Ù",0,"Û",null,null,"Arial Narrow","Q",null,null,"S",null,null,"D",null,null,"F",null,null,"G",null,null,"H",null,null,"J",null,null,"K",null,null,"L",null,null,"M",null,null,"%",null,null,"µ"]
[null,"§","=","§","}","=","}","/","=","/",",","=",",",null,"§","=","§","}","=","}","/","=","/",",","=",",",null,null,null,null,null,null,null,null,null,null,null,null,null,null,null,null,null,null,null,null,null,null,null,null,null,null,null,null,null,null,"q",null,null,"s",null,null,"d",null,null,"f",null,null,"g",null,null,"h",null,null,"j",null,null,"k",null,null,"l",null,null,"m",null,null,"ù",null,null,"*"]
[null,null,"=",null,"|","=","|","_","=","_",null,"=",null,null,null,"=",null,"|","=","|","_","=","_",null,"=",null,null,null,null,"Windings 2","Ë",0,"Ì",0,"Í",0,"Î",0,"Ï",0,"Ñ",0,"Ô",0,"Ö",0,"×",0,"Ø",0,"Ù",0,"Û"]
[null,null,null,null,null,null,null,null,null,null,null,null,null,null,null,null,null,null,null,null,null,null,null,null,null,null,null,null,null,null,null,null,null,null,null,null,null,null,null,null,null,null,null,null,null,null,null,null,null,null,null,null,null,null,null,"Webdings","Q",null,null,"S",null,null,"D",null,null,"F",null,null,"G",null,null,"H",null,null,"J",null,null,"K",null,null,"L",null,null,"M",null,null,"%",null,null,"µ"]
[null,null,null,null,null,null,null,null,null,null,null,null,null,null,null,null,null,null,null,null,null,null,null,null,null,null,null,null,null,"Windgings 3","Ë",0,"Ì",0,"Í",0,"Î",0,"Ï",0,"Ñ",0,"Ô",0,"Ö",0,"×",0,"Ø",0,"Ù",0,"Û",null,null,null,"q",null,null,"s",null,null,"d",null,null,"f",null,null,"g",null,null,"h",null,null,"j",null,null,"k",null,null,"l",null,null,"m",null,null,"ù",null,null,"*"]
[]
[null,"Saisir lettre ou nombre",null,"Correspondance","Police Wending 3",null,null,null,null,null,null,null,null,null,"Saisir lettre ou nombre",null,"Correspondance","Police Webdings",null,null,null,null,null,null,null,null,null,null,null,"ABSENT DU CLAVIER",null,null,null,null,null,null,null,null,null,null,null,null,null,null,null,null,null,null,null,null,null,null,null,null,null,"Windgings","Q",null,null,"S",null,null,"D",null,null,"F",null,null,"G",null,null,"H",null,null,"J",null,null,"K",null,null,"L",null,null,"M",null,null,"%",null,null,"µ"]
[null,"Aa","=",{"$f":"B51","v":"Aa"},"Copiez / collez le symbole sur votre document ou faites un imprim'écran",null,null,null,null,null,null,null,null,null,"Aa","=",{"$f":"O51","v":"Aa"},"Copiez / collez le symbole sur votre document ou faites un imprim'écran",null,null,null,null,null,null,null,null,null,null,null,"Raccourcis","Alt + 0220",null,"Alt + 0223",null,"Alt + 0230",null,"Alt + 0237",null,"Alt + 0247",null,"Alt + 0140",null,"Alt + 0156",null,"Alt + 11",null,"Alt + 12",null,"Alt + 13",null,"Alt + 14",null,"Alt + 6",null,null,null,"q",null,null,"s",null,null,"d",null,null,"f",null,null,"g",null,null,"h",null,null,"j",null,null,"k",null,null,"l",null,null,"m",null,null,"ù",null,null,"*"]
[]
[null,"Majuscules","correspondance",null,"Minuscules","correspondance",null,"Chiffres","correspondance",null,"nombres","correspondance",null,null,"Majuscules","correspondance",null,"Minuscules","correspondance",null,"Chiffres","correspondance",null,"nombres","correspondance",null,null,null,null,"Arial","Ü",null,"ß",null,"æ",null,"í",null,"÷",null,"Œ",null,"œ",null,"♂",null,"♀",null,"♪",null,"♫",null,"♠",null,null,"Windgings 2","Q",null,null,"S",null,null,"D",null,null,"F",null,null,"G",null,null,"H",null,null,"J",null,null,"K",null,null,"L",null,null,"M",null,null,"%",null,null,"µ"]
[null,"A","=","A","a","=","a",1,"=",1,27,"=",27,null,"A","=","A","a","=","a",1,"=",1,27,"=",27,null,null,null,null,null,null,null,null,null,null,null,null,null,null,null,null,null,null,null,null,null,null,null,null,null,null,null,null,null,null,"q",null,null,"s",null,null,"d",null,null,"f",null,null,"g",null,null,"h",null,null,"j",null,null,"k",null,null,"l",null,null,"m",null,null,"ù",null,null,"*"]
[null,"B","=","B","b","=","b",2,"=",2,28,"=",28,null,"B","=","B","b","=","b",2,"=",2,28,"=",28,null,null,null,"Webdings","Ü",0,"ß",0,"æ",0,"í",0,"÷",0,"Œ",0,"œ",0,"♂",0,"♀",0,"♪",0,"♫",0,"♠"]
[null,"C","=","C","c","=","c",3,"=",3,29,"=",29,null,"C","=","C","c","=","c",3,"=",3,29,"=",29,null,null,null,null,null,null,null,null,null,null,null,null,null,null,null,null,null,null,null,null,null,null,null,null,null,null,null,null,null,"Windgings 3","Q",null,null,"S",null,null,"D",null,null,"F",null,null,"G",null,null,"H",null,null,"J",null,null,"K",null,null,"L",null,null,"M",null,null,"%",null,null,"µ"]
[null,"D","=","D","d","=","d",4,"=",4,30,"=",30,null,"D","=","D","d","=","d",4,"=",4,30,"=",30,null,null,null,"Windgins","Ü",0,"ß",0,"æ",0,"í",0,"÷",0,"Œ",0,"œ",0,"♂",0,"♀",0,"♪",0,"♫",0,"♠",null,null,null,"q",null,null,"s",null,null,"d",null,null,"f",null,null,"g",null,null,"h",null,null,"j",null,null,"k",null,null,"l",null,null,"m",null,null,"ù",null,null,"*"]
[null,"E","=","E","e","=","e",5,"=",5,31,"=",31,null,"E","=","E","e","=","e",5,"=",5,31,"=",31]
[null,"F","=","F","f","=","f",6,"=",6,32,"=",32,null,"F","=","F","f","=","f",6,"=",6,32,"=",32,null,null,null,"Windings 2","Ü",0,"ß",0,"æ",0,"í",0,"÷",0,"Œ",0,"œ",0,"♂",0,"♀",0,"♪",0,"♫",0,"♠",null,null,null,"QUATRIÈME RANGÉE "]
[null,"G","=","G","g","=","g",7,"=",7,33,"=",33,null,"G","=","G","g","=","g",7,"=",7,33,"=",33,null,null,null,null,null,null,null,null,null,null,null,null,null,null,null,null,null,null,null,null,null,null,null,null,null,null,null,null,null,"Arial Narrow","<",null,null,"W",null,null,"X",null,null,"C",null,null,"V",null,null,"B",null,null,"N",null,null,"?",null,null,".",null,null,"/",null,null,"§"]
[null,"H","=","H","h","=","h",8,"=",8,34,"=",34,null,"H","=","H","h","=","h",8,"=",8,34,"=",34,null,null,null,"Windgings 3","Ü",0,"ß",0,"æ",0,"í",0,"÷",0,"Œ",0,"œ",0,"♂",0,"♀",0,"♪",0,"♫",0,"♠",null,null,null,"<",null,null,"w",null,null,"x",null,null,"c",null,null,"v",null,null,"b",null,null,"n",null,null,",",null,null,";",null,null,":",null,null,"!"]
[null,"I","=","I","i","=","i",9,"=",9,35,"=",35,null,"I","=","I","i","=","i",9,"=",9,35,"=",35]
[null,"J","=","J","j","=","j",10,"=",10,36,"=",36,null,"J","=","J","j","=","j",10,"=",10,36,"=",36,null,null,null,null,"Pour la couleur de numérotation cliquez sur Couleur de police et choisissez la couleur qui vous convient",null,null,null,null,null,null,null,null,null,null,null,null,null,null,null,null,null,null,null,null,null,null,null,null,"Webdings","<",null,null,"W",null,null,"X",null,null,"C",null,null,"V",null,null,"B",null,null,"N",null,null,"?",null,null,".",null,null,"/",null,null,"§"]
[null,"K","=","K","k","=","k",11,"=",11,37,"=",37,null,"K","=","K","k","=","k",11,"=",11,37,"=",37,null,null,null,null,null,null,null,null,null,null,null,null,null,null,null,null,null,null,null,null,null,null,null,null,null,null,null,null,null,null,"<",null,null,"w",null,null,"x",null,null,"c",null,null,"v",null,null,"b",null,null,"n",null,null,",",null,null,";",null,null,":",null,null,"!"]
[null,"L","=","L","l","=","l",12,"=",12,38,"=",38,null,"L","=","L","l","=","l",12,"=",12,38,"=",38]
[null,"M","=","M","m","=","m",13,"=",13,39,"=",39,null,"M","=","M","m","=","m",13,"=",13,39,"=",39,null,null,null,null,"Polices de caractèes utilisées : ARIAL et CALIBRI en fonction de la largeur de colonne ",null,null,null,null,null,null,null,null,null,null,null,null,null,"ARIAL",null,"CALIBRI",null,null,null,null,null,null,null,null,"Windgings","<",null,null,"W",null,null,"X",null,null,"C",null,null,"V",null,null,"B",null,null,"N",null,null,"?",null,null,".",null,null,"/",null,null,"§"]
[null,"N","=","N","n","=","n",14,"=",14,40,"=",40,null,"N","=","N","n","=","n",14,"=",14,40,"=",40,null,null,null,null,null,null,null,null,null,null,null,null,null,null,null,null,null,null,"arial",null,"calibri",null,null,null,null,null,null,null,null,null,"<",null,null,"w",null,null,"x",null,null,"c",null,null,"v",null,null,"b",null,null,"n",null,null,",",null,null,";",null,null,":",null,null,"!"]
[null,"O","=","O","o","=","o",15,"=",15,41,"=",41,null,"O","=","O","o","=","o",15,"=",15,41,"=",41]
[null,"P","=","P","p","=","p",16,"=",16,42,"=",42,null,"P","=","P","p","=","p",16,"=",16,42,"=",42,null,null,null,null,null,null,null,null,null,null,null,null,null,null,null,null,null,null,null,null,null,null,null,null,null,null,null,null,null,"Windgings 2","<",null,null,"W",null,null,"X",null,null,"C",null,null,"V",null,null,"B",null,null,"N",null,null,"?",null,null,".",null,null,"/",null,null,"§"]
[null,"Q","=","Q","q","=","q",17,"=",17,43,"=",43,null,"Q","=","Q","q","=","q",17,"=",17,43,"=",43,null,null,null,null,null,null,"Copiez / Collez les N° dans vos fiches",null,null,null,null,null,null,null,null,null,null,null,null,null,null,null,null,null,null,null,null,null,null,null,"<",null,null,"w",null,null,"x",null,null,"c",null,null,"v",null,null,"b",null,null,"n",null,null,",",null,null,";",null,null,":",null,null,"!"]
[null,"R","=","R","r","=","r",18,"=",18,44,"=",44,null,"R","=","R","r","=","r",18,"=",18,44,"=",44]
[null,"S","=","S","s","=","s",19,"=",19,45,"=",45,null,"S","=","S","s","=","s",19,"=",19,45,"=",45,null,null,null,null,null,null,"❶",null,"①",null,"❶",null,"①",null,"①",null,"❶",null,"❶",null,"❶",null,null,null,null,null,null,null,null,"Windgings 3","<",null,null,"W",null,null,"X",null,null,"C",null,null,"V",null,null,"B",null,null,"N",null,null,"?",null,null,".",null,null,"/",null,null,"§"]
[null,"T","=","T","t","=","t",20,"=",20,46,"=",46,null,"T","=","T","t","=","t",20,"=",20,46,"=",46,null,null,null,null,null,null,"❷",null,"③",null,"❷",null,"②",null,"③",null,"❷",null,"❷",null,"❷",null,null,null,null,null,null,null,null,null,"<",null,null,"w",null,null,"x",null,null,"c",null,null,"v",null,null,"b",null,null,"n",null,null,",",null,null,";",null,null,":",null,null,"!"]
[null,"U","=","U","u","=","u",21,"=",21,47,"=",47,null,"U","=","U","u","=","u",21,"=",21,47,"=",47,null,null,null,null,null,null,"❸",null,"②",null,"❸",null,"③",null,null,null,"❸",null,"❸",null,"❸"]
[null,"V","=","V","v","=","v",22,"=",22,48,"=",48,null,"V","=","V","v","=","v",22,"=",22,48,"=",48,null,null,null,null,null,null,"❹",null,"④",null,"❹",null,"④",null,"②",null,"❹",null,"❹",null,"❹"]
[null,"W","=","W","w","=","w",23,"=",23,49,"=",49,null,"W","=","W","w","=","w",23,"=",23,49,"=",49,null,null,null,null,null,null,"❺",null,"⑤",null,"❺",null,"⑤",null,"④",null,"❺",null,"❺",null,"❺"]
[null,"X","=","X","x","=","x",24,"=",24,50,"=",50,null,"X","=","X","x","=","x",24,"=",24,50,"=",50,null,null,null,null,null,null,"❻",null,"⑥",null,"❻",null,"⑥",null,"⑤",null,"❻",null,"❻",null,"❻"]
[null,"Y","=","Y","y","=","y",25,"=",25,51,"=",51,null,"Y","=","Y","y","=","y",25,"=",25,51,"=",51,null,null,null,null,null,null,"❼",null,"⑦",null,"❼",null,"⑦",null,"⑥",null,"❼",null,"❼",null,"❼"]
[null,"Z","=","Z","z","=","z",26,"=",26,52,"=",52,null,"Z","=","Z","z","=","z",26,"=",26,52,"=",52,null,null,null,null,null,null,"❽",null,"⑧",null,"❽",null,"⑧",null,"⑦",null,"❽",null,"❽",null,"❽"]
[null,"&","=","&","%","=","%","£","=","£",";","=",";",null,"&","=","&","%","=","%","£","=","£",";","=",";",null,null,null,null,null,null,"❾",null,"⑨",null,"❾",null,"⑨",null,"⑧",null,"❾",null,"❾",null,"❾"]
[null,"é","=","é","#","=","#","@","=","@",":","=",":",null,"é","=","é","#","=","#","@","=","@",":","=",":",null,null,null,null,null,null,"❿",null,"⑩",null,"❿",null,"⑩",null,"⑨",null,"❿",null,"❿",null,"❿"]
[null,"è","=","è","(","=","(","!","=","!","-","=","-",null,"è","=","è","(","=","(","!","=","!","-","=","-",null,null,null,null,null,null,"⓫",null,"⑪",null,"⓫",null,"⑪",null,null,null,"⓫",null,"⓫",null,"⓫"]
[null,"ù","=","ù",")","=",")","?","=","?",".","=",".",null,"ù","=","ù",")","=",")","?","=","?",".","=",".",null,null,null,null,null,null,"⓬",null,"⑫",null,"⓬",null,"⑫",null,null,null,"⓬",null,"⓬",null,"⓬"]
[null,"ç","=","ç","[","=","[",">","=",">","~","=","~",null,"ç","=","ç","[","=","[",">","=",">","~","=","~",null,null,null,null,null,null,"⓭",null,"⑬",null,"⓭",null,"⑬",null,null,null,"⓭",null,"⓭",null,"⓭"]
[null,"à","=","à","]","=","]","<","=","<","\"","=","\"",null,"à","=","à","]","=","]","<","=","<","\"","=","\"",null,null,null,null,null,null,"⓮",null,"⑭",null,"⓮",null,"⑭",null,null,null,"⓮",null,"⓮",null,"⓮"]
[null,"µ","=","µ","{","=","{","\\","=","\\","*","=","*",null,"µ","=","µ","{","=","{","\\","=","\\","*","=","*",null,null,null,null,null,null,"⓯",null,"⑮",null,"⓯",null,"⑮",null,null,null,"⓯",null,"⓯",null,"⓯"]
[null,"§","=","§","}","=","}","/","=","/",",","=",",",null,"§","=","§","}","=","}","/","=","/",",","=",",",null,null,null,null,null,null,"⓰",null,"⑯",null,"⓰",null,"⑯",null,null,null,"⓰",null,"⓰",null,"⓰"]
[null,null,"=",null,"|","=","|","_","=","_",null,"=",null,null,null,"=",null,"|","=","|","_","=","_",null,"=",null,null,null,null,null,null,null,"⓱",null,"⑰",null,"⓱",null,"⑰",null,null,null,"⓱",null,"⓱",null,"⓱"]
[null,null,null,null,null,null,null,null,null,null,null,null,null,null,null,null,null,null,null,null,null,null,null,null,null,null,null,null,null,null,null,null,"⓲",null,"⑱",null,"⓲",null,"⑱",null,null,null,"⓲",null,"⓲",null,"⓲"]
[null,null,null,null,null,null,null,null,null,null,null,null,null,null,null,null,null,null,null,null,null,null,null,null,null,null,null,null,null,null,null,null,"⓳",null,"⑲",null,"⓳",null,"⑲",null,null,null,"⓳",null,"⓳",null,"⓳"]
[null,null,null,null,null,null,null,null,null,null,null,null,null,null,null,null,null,null,null,null,null,null,null,null,null,null,null,null,null,null,null,null,"⓴",null,"⑳",null,"⓴",null,null,null,null,null,"⓴",null,"⓴",null,"⓴"]
[null,"Saisir lettre ou nombre",null,"Correspondance","Police ZDingbats",null,null,null,null,null,null,null,null,null,"Saisir lettre ou nombre",null,"Correspondance","Police Marlett"]
[null,"Aa","=",{"$f":"B93","v":"Aa"},"Pour reproduire la police de caractère vous pouvez utiliser le pinceau",null,null,null,null,null,null,null,null,null,"Aa","=",{"$f":"O93","v":"Aa"},"Copiez / collez le symbole sur votre document ou faites un imprim'écran"]
[]
[null,"Majuscules","correspondance",null,"Minuscules","correspondance",null,"Chiffres","correspondance",null,"nombres","correspondance",null,null,"Majuscules","correspondance",null,"Minuscules","correspondance",null,"Chiffres","correspondance",null,"nombres","correspondance"]
[null,"A","=","A","a","=","a",1,"=",1,27,"=",27,null,"A","=","A","a","=","a",1,"=",1,27,"=",27]
[null,"B","=","B","b","=","b",2,"=",2,28,"=",28,null,"B","=","B","b","=","b",2,"=",2,28,"=",28]
[null,"C","=","C","c","=","c",3,"=",3,29,"=",29,null,"C","=","C","c","=","c",3,"=",3,29,"=",29]
[null,"D","=","D","d","=","d",4,"=",4,30,"=",30,null,"D","=","D","d","=","d",4,"=",4,30,"=",30]
[null,"E","=","E","e","=","e",5,"=",5,31,"=",31,null,"E","=","E","e","=","e",5,"=",5,31,"=",31]
[null,"F","=","F","f","=","f",6,"=",6,32,"=",32,null,"F","=","F","f","=","f",6,"=",6,32,"=",32]
[null,"G","=","G","g","=","g",7,"=",7,33,"=",33,null,"G","=","G","g","=","g",7,"=",7,33,"=",33]
[null,"H","=","H","h","=","h",8,"=",8,34,"=",34,null,"H","=","H","h","=","h",8,"=",8,34,"=",34]
[null,"I","=","I","i","=","i",9,"=",9,35,"=",35,null,"I","=","I","i","=","i",9,"=",9,35,"=",35]
[null,"J","=","J","j","=","j",10,"=",10,36,"=",36,null,"J","=","J","j","=","j",10,"=",10,36,"=",36]
[null,"K","=","K","k","=","k",11,"=",11,37,"=",37,null,"K","=","K","k","=","k",11,"=",11,37,"=",37]
[null,"L","=","L","l","=","l",12,"=",12,38,"=",38,null,"L","=","L","l","=","l",12,"=",12,38,"=",38]
[null,"M","=","M","m","=","m",13,"=",13,39,"=",39,null,"M","=","M","m","=","m",13,"=",13,39,"=",39]
[null,"N","=","N","n","=","n",14,"=",14,40,"=",40,null,"N","=","N","n","=","n",14,"=",14,40,"=",40]
[null,"O","=","O","o","=","o",15,"=",15,41,"=",41,null,"O","=","O","o","=","o",15,"=",15,41,"=",41]
[null,"P","=","P","p","=","p",16,"=",16,42,"=",42,null,"P","=","P","p","=","p",16,"=",16,42,"=",42]
[null,"Q","=","Q","q","=","q",17,"=",17,43,"=",43,null,"Q","=","Q","q","=","q",17,"=",17,43,"=",43]
[null,"R","=","R","r","=","r",18,"=",18,44,"=",44,null,"R","=","R","r","=","r",18,"=",18,44,"=",44]
[null,"S","=","S","s","=","s",19,"=",19,45,"=",45,null,"S","=","S","s","=","s",19,"=",19,45,"=",45]
[null,"T","=","T","t","=","t",20,"=",20,46,"=",46,null,"T","=","T","t","=","t",20,"=",20,46,"=",46]
[null,"U","=","U","u","=","u",21,"=",21,47,"=",47,null,"U","=","U","u","=","u",21,"=",21,47,"=",47]
[null,"V","=","V","v","=","v",22,"=",22,48,"=",48,null,"V","=","V","v","=","v",22,"=",22,48,"=",48]
[null,"W","=","W","w","=","w",23,"=",23,49,"=",49,null,"W","=","W","w","=","w",23,"=",23,49,"=",49]
[null,"X","=","X","x","=","x",24,"=",24,50,"=",50,null,"X","=","X","x","=","x",24,"=",24,50,"=",50]
[null,"Y","=","Y","y","=","y",25,"=",25,51,"=",51,null,"Y","=","Y","y","=","y",25,"=",25,51,"=",51]
[null,"Z","=","Z","z","=","z",26,"=",26,52,"=",52,null,"Z","=","Z","z","=","z",26,"=",26,52,"=",52]
[null,"&","=","&","%","=","%","£","=","£",";","=",";",null,"&","=","&","%","=","%","£","=","£",";","=",";"]
[null,"é","=","é","#","=","#","@","=","@",":","=",":",null,"é","=","é","#","=","#","@","=","@",":","=",":"]
[null,"è","=","è","(","=","(","!","=","!","-","=","-",null,"è","=","è","(","=","(","!","=","!","-","=","-"]
[null,"ù","=","ù",")","=",")","?","=","?",".","=",".",null,"ù","=","ù",")","=",")","?","=","?",".","=","."]
[null,"ç","=","ç","[","=","[",">","=",">","~","=","~",null,"ç","=","ç","[","=","[",">","=",">","~","=","~"]
[null,"à","=","à","]","=","]","<","=","<","\"","=","\"",null,"à","=","à","]","=","]","<","=","<","\"","=","\""]
[null,"µ","=","µ","{","=","{","\\","=","\\","*","=","*",null,"µ","=","µ","{","=","{","\\","=","\\","*","=","*"]
[null,"§","=","§","}","=","}","/","=","/",",","=",",",null,"§","=","§","}","=","}","/","=","/",",","=",","]
[null,null,"=",null,"|","=","|","_","=","_",null,"=",null,null,null,"=",null,"|","=","|","_","=","_",null,"="]
[]
[]
[]
[null,"Saisir lettre ou nombre",null,"Correspondance","Police MT Extra",null,null,null,null,null,null,null,null,null,"Saisir lettre ou nombre",null,"Correspondance","Police Symbol"]
[null,"Aa","=",{"$f":"B135","v":"Aa"},"Copiez / collez le symbole sur votre document ou faites un imprim'écran",null,null,null,null,null,null,null,null,null,"Aa","=",{"$f":"O135","v":"Aa"},"Copiez / collez le symbole sur votre document ou faites un imprim'écran"]
[]
[null,"Majuscules","correspondance",null,"Minuscules","correspondance",null,"Chiffres","correspondance",null,"nombres","correspondance",null,null,"Majuscules","correspondance",null,"Minuscules","correspondance",null,"Chiffres","correspondance",null,"nombres","correspondance"]
[null,"A","=","A","a","=","a",1,"=",1,27,"=",27,null,"A","=","A","a","=","a",1,"=",1,27,"=",27]
[null,"B","=","B","b","=","b",2,"=",2,28,"=",28,null,"B","=","B","b","=","b",2,"=",2,28,"=",28]
[null,"C","=","C","c","=","c",3,"=",3,29,"=",29,null,"C","=","C","c","=","c",3,"=",3,29,"=",29]
[null,"D","=","D","d","=","d",4,"=",4,30,"=",30,null,"D","=","D","d","=","d",4,"=",4,30,"=",30]
[null,"E","=","E","e","=","e",5,"=",5,31,"=",31,null,"E","=","E","e","=","e",5,"=",5,31,"=",31]
[null,"F","=","F","f","=","f",6,"=",6,32,"=",32,null,"F","=","F","f","=","f",6,"=",6,32,"=",32]
[null,"G","=","G","g","=","g",7,"=",7,33,"=",33,null,"G","=","G","g","=","g",7,"=",7,33,"=",33]
[null,"H","=","H","h","=","h",8,"=",8,34,"=",34,null,"H","=","H","h","=","h",8,"=",8,34,"=",34]
[null,"I","=","I","i","=","i",9,"=",9,35,"=",35,null,"I","=","I","i","=","i",9,"=",9,35,"=",35]
[null,"J","=","J","j","=","j",10,"=",10,36,"=",36,null,"J","=","J","j","=","j",10,"=",10,36,"=",36]
[null,"K","=","K","k","=","k",11,"=",11,37,"=",37,null,"K","=","K","k","=","k",11,"=",11,37,"=",37]
[null,"L","=","L","l","=","l",12,"=",12,38,"=",38,null,"L","=","L","l","=","l",12,"=",12,38,"=",38]
[null,"M","=","M","m","=","m",13,"=",13,39,"=",39,null,"M","=","M","m","=","m",13,"=",13,39,"=",39]
[null,"N","=","N","n","=","n",14,"=",14,40,"=",40,null,"N","=","N","n","=","n",14,"=",14,40,"=",40]
[null,"O","=","O","o","=","o",15,"=",15,41,"=",41,null,"O","=","O","o","=","o",15,"=",15,41,"=",41]
[null,"P","=","P","p","=","p",16,"=",16,42,"=",42,null,"P","=","P","p","=","p",16,"=",16,42,"=",42]
[null,"Q","=","Q","q","=","q",17,"=",17,43,"=",43,null,"Q","=","Q","q","=","q",17,"=",17,43,"=",43]
[null,"R","=","R","r","=","r",18,"=",18,44,"=",44,null,"R","=","R","r","=","r",18,"=",18,44,"=",44]
[null,"S","=","S","s","=","s",19,"=",19,45,"=",45,null,"S","=","S","s","=","s",19,"=",19,45,"=",45]
[null,"T","=","T","t","=","t",20,"=",20,46,"=",46,null,"T","=","T","t","=","t",20,"=",20,46,"=",46]
[null,"U","=","U","u","=","u",21,"=",21,47,"=",47,null,"U","=","U","u","=","u",21,"=",21,47,"=",47]
[null,"V","=","V","v","=","v",22,"=",22,48,"=",48,null,"V","=","V","v","=","v",22,"=",22,48,"=",48]
[null,"W","=","W","w","=","w",23,"=",23,49,"=",49,null,"W","=","W","w","=","w",23,"=",23,49,"=",49]
[null,"X","=","X","x","=","x",24,"=",24,50,"=",50,null,"X","=","X","x","=","x",24,"=",24,50,"=",50]
[null,"Y","=","Y","y","=","y",25,"=",25,51,"=",51,null,"Y","=","Y","y","=","y",25,"=",25,51,"=",51]
[null,"Z","=","Z","z","=","z",26,"=",26,52,"=",52,null,"Z","=","Z","z","=","z",26,"=",26,52,"=",52]
[null,"&","=","&","%","=","%","£","=","£",";","=",";",null,"&","=","&","%","=","%","£","=","£",";","=",";"]
[null,"é","=","é","#","=","#","@","=","@",":","=",":",null,"é","=","é","#","=","#","@","=","@",":","=",":"]
[null,"è","=","è","(","=","(","!","=","!","-","=","-",null,"è","=","è","(","=","(","!","=","!","-","=","-"]
[null,"ù","=","ù",")","=",")","?","=","?",".","=",".",null,"ù","=","ù",")","=",")","?","=","?",".","=","."]
[null,"ç","=","ç","[","=","[",">","=",">","~","=","~",null,"ç","=","ç","[","=","[",">","=",">","~","=","~"]
[null,"à","=","à","]","=","]","<","=","<","\"","=","\"",null,"à","=","à","]","=","]","<","=","<","\"","=","\""]
[null,"µ","=","µ","{","=","{","\\","=","\\","*","=","*",null,"µ","=","µ","{","=","{","\\","=","\\","*","=","*"]
[null,"§","=","§","}","=","}","/","=","/",",","=",",",null,"§","=","§","}","=","}","/","=","/",",","=",","]
[null,null,"=",null,"|","=","|","_","=","_",null,"=",null,null,null,"=",null,"|","=","|","_","=","_",null,"="]

{"sheet":"CODES COULEURS","index":15,"n_rows":98,"n_cols":19,"rows_kept":98,"cut":false,"hidden":false,"merged":[[92,8,94,15],[40,4,40,6],[41,4,41,6],[42,4,42,6],[43,4,43,6],[44,4,44,6],[90,8,91,15],[39,4,39,6],[28,4,28,6],[29,4,29,6],[30,4,30,6],[31,4,31,6],[32,4,32,6],[33,4,33,6],[34,4,34,6],[35,4,35,6],[36,4,36,6],[37,4,37,6],[38,4,38,6],[25,4,25,6],[17,1,17,2],[17,4,17,6],[18,4,18,6],[19,1,19,2],[19,4,19,6],[20,4,20,6],[21,1,21,2],[21,4,21,6],[22,4,22,6],[23,4,23,6],[24,4,24,6],[14,4,14,6],[14,8,15,15],[15,1,15,2],[15,4,15,6],[16,4,16,6],[16,8,16,15],[10,4,10,6],[11,1,11,2],[11,4,11,6],[12,4,12,6],[13,1,13,2],[13,4,13,6],[5,1,5,6],[5,8,5,15],[7,1,7,2],[7,4,7,6],[9,1,9,2],[9,4,9,6]]}
[]
[null,null,null,null,null,null,null,null,null,null,"Mise à jour du 14 Décembre 2021"]
[null,null,null,null,null,null,null,null,null,null,"annule ou remplace les versions précédentes"]
[]
[]
[null,"CLASSEMENT SIMPLIFIÉ",null,null,null,null,null,null,"Palette de couleurs, Excel",null,null,null,null,null,null,null,null,"1.Codes de couleur HTML sécurisés pour le Web / Tableau de référence"]
[null,null,null,null,null,null,null,null,null,null,null,null,null,null,{"$f":"\"Page \"&_xlfn.SHEET()&\" sur \"&_xlfn.SHEETS()","v":"Page 16 sur 16"},null,null,"Lien >","https://encycolorpedia.com/websafe"]
[null,"H.ŒUVRES",null,null,"PREPARATIONS CHAUDES",null,null,null,1,2,3,4,5,6,7,8]
[null,null,null,null,null,null,null,null,9,10,11,12,13,14,15,16,null,"2.Codes de couleurs HTML / Tableau de référence"]
[null,"CRUDITES",null,null,"ENTRÉES",null,null,null,17,18,19,20,21,22,23,24,null,"Lien >","https://encycolorpedia.com/html"]
[null,null,null,null,"POISSONS",null,null,null,25,26,27,28,29,30,31,32]
[null,"Crudité",null,null,"VOLAILLES",null,null,null,33,34,35,36,37,38,39,40,null,"3.Codes de couleurs nommés / Tableau de référence"]
[null,null,null,null,"VIANDES",null,null,null,41,42,43,44,45,46,47,48,null,"Lien >","https://encycolorpedia.com/named"]
[null,"LEGUMES  ",null,null,"PLATS COMPLETS",null,null,null,49,50,51,52,53,54,55,56]
[null,null,null,null,"ACCOMPAGNEMENTS",null,null,null,"http://translate.google.fr/translate?hl=fr&langpair=en|fr&u=http://dmcritchie.mvps.org/excel/colors.htm",null,null,null,null,null,null,null,null,"Correspondance des couleurs de peinture et convertisseur"]
[null,"CUIDITES",null,null,"PATISSERIES",null,null,null,null,null,null,null,null,null,null,null,null,"Lien >","https://encycolorpedia.com/paints"]
[null,null,null,null,"PREPARATIONS CHAUDES",null,null,null,"Palette de couleurs, Excel"]
[null,"Cuidité ",null,null,"PLAT PRINCIPAL",null,null,null,"Couleur 0]","[Couleur 0]","[Couleur 15]","[Couleur 15]","[Couleur 30]","[Couleur 30]","[Couleur 45]","[Couleur 45]"]
[null,null,null,null,"CRUDITES",null,null,null,"[Couleur 1]","[Couleur 1]","[Couleur 16]","[Couleur 16]","[Couleur 31]","[Couleur 31]","[Couleur 46]","[Couleur 46]"]
[null,"Protéines",null,null,"CUIDITES",null,null,null,"[Couleur 2]","[Couleur 2]","[Couleur 17]","[Couleur 17]","[Couleur 32]","[Couleur 32]","[Couleur 47]","[Couleur 47]"]
[null,null,null,null,"FECULENTS",null,null,null,"[Couleur 3]","[Couleur 3]","[Couleur 18]","[Couleur 18]","[Couleur 33]","[Couleur 33]","[Couleur 48]","[Couleur 48]"]
[null,"Laitages",null,null,"COMPOSES VERTS",null,null,null,"[Couleur 4]","[Couleur 4]","[Couleur 19]","[Couleur 19]","[Couleur 34]","[Couleur 34]","[Couleur 49]","[Couleur 49]"]
[null,null,null,null,"LAITAGES FROMAGES",null,null,null,"[Couleur 5]","[Couleur 5]","[Couleur 20]","[Couleur 20]","[Couleur 35]","[Couleur 35]","[Couleur 50]","[Couleur 50]"]
[null,null,null,null,"LAITAGES +FECULENTS",null,null,null,"[Couleur 6]","[Couleur 6]","[Couleur 21]","[Couleur 21]","[Couleur 36]","[Couleur 36]","[Couleur 51]","[Couleur 51]"]
[null,null,null,null,"DESSERTS",null,null,null,"[Couleur 7]","[Couleur 7]","[Couleur 22]","[Couleur 22]","[Couleur 37]","[Couleur 37]","[Couleur 52]","[Couleur 52]"]
[null,null,null,null,"GOUTER",null,null,null,"[Couleur 8]","[Couleur 8]","[Couleur 23]","[Couleur 23]","[Couleur 38]","[Couleur 38]","[Couleur 53]","[Couleur 53]"]
[null,null,null,null,null,null,null,null,"[Couleur 9]","[Couleur 9]","[Couleur 24]","[Couleur 24]","[Couleur 39]","[Couleur 39]","[Couleur 54]","[Couleur 54]"]
[null,null,null,null,null,null,"Code couleur Rouge Vert Bleu RVB",null,"[Couleur 10]","[Couleur 10]","[Couleur 25]","[Couleur 25]","[Couleur 40]","[Couleur 40]","[Couleur 55]","[Couleur 55]"]
[null,null,null,null,"R51-V153 B102",null,null,null,"[Couleur 11]","[Couleur 11]","[Couleur 26]","[Couleur 26]","[Couleur 41]","[Couleur 41]","[Couleur 56]","[Couleur 56]"]
[null,null,null,null,"R50-V204 B255",null,null,null,"[Couleur 12]","[Couleur 12]","[Couleur 27]","[Couleur 27]","[Couleur 42]","[Couleur 42]"]
[null,null,null,null,"R255-V204 B0",null,null,null,"[Couleur 13]","[Couleur 13]","[Couleur 28]","[Couleur 28]","[Couleur 43]","[Couleur 43]"]
[null,null,null,null,"R255-V0 B0",null,null,null,"[Couleur 14]","[Couleur 14]","[Couleur 29]","[Couleur 29]","[Couleur 44]","[Couleur 44]"]
[null,null,null,null,"R255-V102 B0"]
[null,null,null,null,"R0-V255 B0",null,null,null,"Intérieur","police","HTML","bgcolor =","Rouge ","Vert","Bleu","Couleur"]
[null,null,null,null,"R255-V204 B153",null,null,null,"Noire","[Couleur 1]","# 000000","# 000000",0,0,0,"[Noir]"]
[null,null,null,null,"R255-V153 B204",null,null,null,"Blanc","[Couleur 2]","# FFFFFF","# FFFFFF",255,255,255,"[Blanc]"]
[null,null,null,null,"R255-V0 B255",null,null,null,"Rouge","[Couleur 3]","# FF0000","# FF0000",255,0,0,"[Rouge]"]
[null,null,null,null,"R0-V128 B0",null,null,null,"Vert","[Couleur 4]","# 00FF00","# 00FF00",0,255,0,"[Vert]"]
[null,null,null,null,"R153-V204 B0",null,null,null,"Bleu","[Couleur 5]","# 0000FF","# 0000FF",0,0,255,"[Bleu]"]
[null,null,null,null,"R153-V51 B0",null,null,null,"Jaune","[Couleur 6]","# FFFF00","# FFFF00",255,255,0,"[Jaune]"]
[null,null,null,null,"R0-V255 B0",null,null,null,"Magenta","[Couleur 7]","# FF00FF","# FF00FF",255,0,255,"[Magenta]"]
[null,null,null,null,"R0-V0 B255",null,null,null,"Cyan","[Couleur 8]","# 00FFFF","# 00FFFF",0,255,255,"[Cyan]"]
[null,null,null,null,"R153-V204 B255",null,null,null,"[Couleur 9]","[Couleur 9]","# 800000","# 800000",128,0,0,"[Couleur 9]"]
[null,null,null,null,"R0-V102 B204",null,null,null,"[Couleur 10]","[Couleur 10]","# 008000","# 008000",0,128,0,"[Couleur 10]"]
[null,null,null,null,"R204-V153 B255",null,null,null,"[Couleur 11]","[Couleur 11]","# 000080","# 000080",0,0,128,"[Couleur 11]"]
[null,null,null,null,null,null,null,null,"[Couleur 12]","[Couleur 12]","# 808000","# 808000",128,128,0,"[Couleur 12]"]
[null,null,null,null,null,null,null,null,"[Couleur 13]","[Couleur 13]","# 800080","# 800080",128,0,128,"[Couleur 13]"]
[null,null,null,null,null,null,null,null,"[Couleur 14]","[Couleur 14]","# 008080","# 008080",0,128,128,"[Couleur 14]"]
[null,null,null,null,null,null,null,null,"[Couleur 15]","[Couleur 15]","# C0C0C0","# C0C0C0",192,192,192,"[Couleur 15]"]
[null,null,null,null,null,null,null,null,"[Couleur 16]","[Couleur 16]","# 808080","# 808080",128,128,128,"[Couleur 16]"]
[null,null,null,null,null,null,null,null,"[Couleur 17]","[Couleur 17]","# 9999FF","# 9999FF",153,153,255,"[Couleur 17]"]
[null,null,null,null,null,null,null,null,"[Couleur 18]","[Couleur 18]","# 993366","# 993366",153,51,102,"[Couleur 18]"]
[]
[null,null,null,null,null,null,null,null,"[Couleur 20]","[Couleur 20]","# CCFFFF","# CCFFFF",204,255,255,"[Couleur 20]"]
[null,null,null,null,null,null,null,null,"[Couleur 21]","[Couleur 21]","# 660066","# 660066",102,0,102,"[Couleur 21]"]
[null,null,null,null,null,null,null,null,"[Couleur 22]","[Couleur 22]","# FF8080","# FF8080",255,128,128,"[Couleur 22]"]
[null,null,null,null,null,null,null,null,"[Couleur 23]","[Couleur 23]","# 0066CC","# 0066CC",0,102,204,"[Couleur 23]"]
[null,null,null,null,null,null,null,null,"[Couleur 24]","[Couleur 24]","# CCCCFF","# CCCCFF",204,204,255,"[Couleur 24]"]
[null,null,null,null,null,null,null,null,"[Couleur 25]","[Couleur 25]","# 000080","# 000080",0,0,128,"[Couleur 25]"]
[null,null,null,null,null,null,null,null,"[Couleur 26]","[Couleur 26]","# FF00FF","# FF00FF",255,0,255,"[Couleur 26]"]
[null,null,null,null,null,null,null,null,"[Couleur 27]","[Couleur 27]","# FFFF00","# FFFF00",255,255,0,"[Couleur 27]"]
[null,null,null,null,null,null,null,null,"[Couleur 28]","[Couleur 28]","# 00FFFF","# 00FFFF",0,255,255,"[Couleur 28]"]
[null,null,null,null,null,null,null,null,"[Couleur 29]","[Couleur 29]","# 800080","# 800080",128,0,128,"[Couleur 29]"]
[null,null,null,null,null,null,null,null,"[Couleur 30]","[Couleur 30]","# 800000","# 800000",128,0,0,"[Couleur 30]"]
[null,null,null,null,null,null,null,null,"[Couleur 31]","[Couleur 31]","# 008080","# 008080",0,128,128,"[Couleur 31]"]
[null,null,null,null,null,null,null,null,"[Couleur 32]","[Couleur 32]","# 0000FF","# 0000FF",0,0,255,"[Couleur 32]"]
[null,null,null,null,null,null,null,null,"[Couleur 33]","[Couleur 33]","# 00CCFF","# 00CCFF",0,204,255,"[Couleur 33]"]
[null,null,null,null,null,null,null,null,"[Couleur 34]","[Couleur 34]","# CCFFFF","# CCFFFF",204,255,255,"[Couleur 34]"]
[null,null,null,null,null,null,null,null,"[Couleur 35]","[Couleur 35]","# CCFFCC","# CCFFCC",204,255,204,"[Couleur 35]"]
[null,null,null,null,null,null,null,null,"[Couleur 36]","[Couleur 36]","# FFFF99","# FFFF99",255,255,153,"[Couleur 36]"]
[null,null,null,null,null,null,null,null,"[Couleur 37]","[Couleur 37]","# 99CCFF","# 99CCFF",153,204,255,"[Couleur 37]"]
[null,null,null,null,null,null,null,null,"[Couleur 38]","[Couleur 38]","# FF99CC","# FF99CC",255,153,204,"[Couleur 38]"]
[null,null,null,null,null,null,null,null,"[Couleur 39]","[Couleur 39]","# CC99FF","# CC99FF",204,153,255,"[Couleur 39]"]
[null,null,null,null,null,null,null,null,"[Couleur 40]","[Couleur 40]","# FFCC99","# FFCC99",255,204,153,"[Couleur 40]"]
[null,null,null,null,null,null,null,null,"[Couleur 41]","[Couleur 41]","# 3366FF","# 3366FF",51,102,255,"[Couleur 41]"]
[null,null,null,null,null,null,null,null,"[Couleur 42]","[Couleur 42]","# 33CCCC","# 33CCCC",51,204,204,"[Couleur 42]"]
[null,null,null,null,null,null,null,null,"[Couleur 43]","[Couleur 43]","# 99CC00","# 99CC00",153,204,0,"[Couleur 43]"]
[null,null,null,null,null,null,null,null,"[Couleur 44]","[Couleur 44]","# FFCC00","# FFCC00",255,204,0,"[Couleur 44]"]
[null,null,null,null,null,null,null,null,"[Couleur 45]","[Couleur 45]","# FF9900","# FF9900",255,153,0,"[Couleur 45]"]
[null,null,null,null,null,null,null,null,"[Couleur 46]","[Couleur 46]","# FF6600","# FF6600",255,102,0,"[Couleur 46]"]
[null,null,null,null,null,null,null,null,"[Couleur 47]","[Couleur 47]","# 666699","# 666699",102,102,153,"[Couleur 47]"]
[null,null,null,null,null,null,null,null,"[Couleur 48]","[Couleur 48]","# 969696","# 969696",150,150,150,"[Couleur 48]"]
[null,null,null,null,null,null,null,null,"[Couleur 49]","[Couleur 49]","# 003366","# 003366",0,51,102,"[Couleur 49]"]
[null,null,null,null,null,null,null,null,"[Couleur 50]","[Couleur 50]","# 339966","# 339966",51,153,102,"[Couleur 50]"]
[null,null,null,null,null,null,null,null,"[Couleur 51]","[Couleur 51]","# 003300","# 003300",0,51,0,"[Couleur 51]"]
[null,null,null,null,null,null,null,null,"[Couleur 52]","[Couleur 52]","# 333300","# 333300",51,51,0,"[Couleur 52]"]
[null,null,null,null,null,null,null,null,"[Couleur 53]","[Couleur 53]","# 993300","# 993300",153,51,0,"[Couleur 53]"]
[null,null,null,null,null,null,null,null,"[Couleur 54]","[Couleur 54]","# 993366","# 993366",153,51,102,"[Couleur 54]"]
[null,null,null,null,null,null,null,null,"[Couleur 55]","[Couleur 55]","# 333399","# 333399",51,51,153,"[Couleur 55]"]
[null,null,null,null,null,null,null,null,"[Couleur 56]","[Couleur 56]","# 333333","# 333333",51,51,51,"[Couleur 56]"]
[null,null,null,null,null,null,null,null,"Excel reconnaît uniquement les noms de couleur de 1 à 8 (Noir, Blanc, Rouge, Vert, Bleu, Jaune, Magenta et Cyan). Les couleurs 1-16 sont largement compris les noms de couleur dans la palette de couleur VGA. "]
[]
[null,null,null,null,null,null,null,null,"Parmi les 56 couleurs seulement 40 couleurs apparaissent sur la palette.Les 40 noms de couleurs indiquées sur la palette de couleurs Excel sont à des fins descriptives seulement."]
[]
[]
[]
[null,null,null,null,null,null,null,null,"Les paires de couleurs suivantes sont de la même couleur "]
[null,null,null,null,null,null,null,null,"11 & 25, 5 & 32, 14 & 31, 8 et 28, 9 & 30, 13 & 29, 18 & 54, 20 & 34, 7 & 26, et 6 et 27."]